[
  {
    "prizeID": 3,
    "winnerlist": [
      3,
      4
    ],
    "year": 1903,
    "name": "The nobel prize in chemistry 1903",
    "category": "CHEMISTRY"
  },
  {
    "prizeID": 4,
    "winnerlist": [
      3,
      4
    ],
    "year": 1903,
    "name": "The nobel prize in physics 1903",
    "category": "PHYSICS"
  }
]