2019-12-17 22:34:17.077766: W tensorflow/compiler/jit/mark_for_compilation_pass.cc:1412] (One-time warning): Not using XLA:CPU for cluster because envvar TF_XLA_FLAGS=--tf_xla_cpu_global_jit was not set.  If you want XLA:CPU, either set that envvar, or use experimental_jit_scope to enable XLA:CPU.  To confirm that XLA is active, pass --vmodule=xla_compilation_cache=1 (as a proper command-line flag, not via TF_XLA_FLAGS) or set the envvar XLA_FLAGS=--xla_hlo_profile.
Step 500
Step 1000
Step 2000
==========================================
Episode:  0
Reward:  -150.0182494887115
Mean Reward -150.0182494887115
Max reward so far:  -150.0182494887115
Model saved. Also written some other stats...
Step 500
Step 1000
Step 1500
Step 2000
==========================================
Episode:  1
Reward:  -139.69398734306264
Mean Reward -144.85611841588707
Max reward so far:  -139.69398734306264
Step 500
Step 1000
Step 1500
Step 2000
==========================================
Episode:  2
Reward:  -122.70277329500814
Mean Reward -137.47167004226074
Max reward so far:  -122.70277329500814
Step 500
Step 1000
Step 1500
==========================================
Episode:  3
Reward:  -156.89264154976465
Mean Reward -142.32691291913673
Max reward so far:  -122.70277329500814
Step 500
Step 1000
Step 1500
Step 2000
==========================================
Episode:  4
Reward:  -127.84478401966288
Mean Reward -139.43048713924196
Max reward so far:  -122.70277329500814
Step 500
Step 1000
Step 1500
Step 2000
==========================================
Episode:  5
Reward:  -127.68748118676494
Mean Reward -137.47331948049577
Max reward so far:  -122.70277329500814
Step 500
Step 1000
Step 1500
==========================================
Episode:  6
Reward:  -127.64389241143621
Mean Reward -136.06911561348727
Max reward so far:  -122.70277329500814
Step 500
Step 1000
Step 1500
Step 2000
==========================================
Episode:  7
Reward:  -116.25098922475752
Mean Reward -133.59184981489608
Max reward so far:  -116.25098922475752
Step 500
Step 1000
Step 1500
Step 2000
==========================================
Episode:  8
Reward:  -111.68624502225904
Mean Reward -131.1578937268253
Max reward so far:  -111.68624502225904
Step 500
Step 1000
Step 1500
Step 2000
==========================================
Episode:  9
Reward:  -105.26291229537796
Mean Reward -128.56839558368057
Max reward so far:  -105.26291229537796
Step 500
Step 1000
Step 1500
Step 2000
==========================================
Episode:  10
Reward:  -108.0756596065365
Mean Reward -126.70541958575836
Max reward so far:  -105.26291229537796
Step 1000
Step 1500
Step 2000
==========================================
Episode:  11
Reward:  -105.00265623380288
Mean Reward -124.8968559730954
Max reward so far:  -105.00265623380288
Step 500
Step 1000
Step 1500
Step 2000
==========================================
Episode:  12
Reward:  -103.09792483644048
Mean Reward -123.22001511642965
Max reward so far:  -103.09792483644048
Step 500
Step 1000
Step 1500
==========================================
Episode:  13
Reward:  -12.198395301697055
Mean Reward -115.28989941537732
Max reward so far:  -12.198395301697055
==========================================
Episode:  14
Reward:  91.80276966673995
Mean Reward -101.4837214765695
Max reward so far:  91.80276966673995
Step 500
==========================================
Episode:  15
Reward:  70.83585144524022
Mean Reward -90.71374816895639
Max reward so far:  91.80276966673995
Step 500
Step 1000
Step 2000
==========================================
Episode:  16
Reward:  -117.84317763709019
Mean Reward -92.30959696119955
Max reward so far:  91.80276966673995
Step 500
Step 1500
Step 2000
==========================================
Episode:  17
Reward:  -130.0704338812049
Mean Reward -94.40742123453317
Max reward so far:  91.80276966673995
Step 500
Step 1000
Step 1500
Step 2000
==========================================
Episode:  18
Reward:  -114.59838570574001
Mean Reward -95.470103575123
Max reward so far:  91.80276966673995
Step 1000
Step 1500
Step 2000
==========================================
Episode:  19
Reward:  -110.73354593618186
Mean Reward -96.23327569317595
Max reward so far:  91.80276966673995
Step 500
Step 1000
Step 1500
Step 2000
==========================================
Episode:  20
Reward:  -126.03345800863227
Mean Reward -97.65233199391196
Max reward so far:  91.80276966673995
Step 500
Step 1000
Step 1500
Step 2000
==========================================
Episode:  21
Reward:  -133.75912599583575
Mean Reward -99.29354990309031
Max reward so far:  91.80276966673995
Step 500
Step 1000
Step 2000
==========================================
Episode:  22
Reward:  -130.29215561965202
Mean Reward -100.64131536902778
Max reward so far:  91.80276966673995
Step 500
Step 1000
Step 1500
Step 2000
==========================================
Episode:  23
Reward:  -102.10303406495228
Mean Reward -100.70222031469132
Max reward so far:  91.80276966673995
Step 500
Step 1000
Step 1500
Step 2000
==========================================
Episode:  24
Reward:  -119.17275819380234
Mean Reward -101.44104182985575
Max reward so far:  91.80276966673995
Step 500
Step 1000
Step 1500
Step 2000
==========================================
Episode:  25
Reward:  -92.9285873336969
Mean Reward -101.11363973384962
Max reward so far:  91.80276966673995
Step 500
Step 1000
Step 1500
Step 2000
==========================================
Episode:  26
Reward:  -115.66695045187808
Mean Reward -101.65265124192476
Max reward so far:  91.80276966673995
Step 500
Step 1000
Step 1500
Step 2000
==========================================
Episode:  27
Reward:  -120.02510345192667
Mean Reward -102.30881024942482
Max reward so far:  91.80276966673995
Step 1000
Step 1500
Step 2000
==========================================
Episode:  28
Reward:  -96.64520935955545
Mean Reward -102.11351366701552
Max reward so far:  91.80276966673995
Step 500
Step 1000
Step 1500
Step 2000
==========================================
Episode:  29
Reward:  -98.17700569905485
Mean Reward -101.98229673475018
Max reward so far:  91.80276966673995
Step 500
Step 1000
Step 1500
==========================================
Episode:  30
Reward:  -124.80177054878348
Mean Reward -102.71840879326739
Max reward so far:  91.80276966673995
Step 500
Step 1000
Step 1500
Step 2000
==========================================
Episode:  31
Reward:  -110.94405693725572
Mean Reward -102.97546029776703
Max reward so far:  91.80276966673995
Step 500
Step 1000
Step 1500
Step 2000
==========================================
Episode:  32
Reward:  -114.07319621714767
Mean Reward -103.31175532562705
Max reward so far:  91.80276966673995
Step 500
==========================================
Episode:  33
Reward:  54.80997554255382
Mean Reward -98.66111618244526
Max reward so far:  91.80276966673995
Step 500
Step 1000
Step 1500
Step 2000
==========================================
Episode:  34
Reward:  -119.1806303709817
Mean Reward -99.24738801640345
Max reward so far:  91.80276966673995
Step 500
Step 1000
Step 1500
Step 2000
==========================================
Episode:  35
Reward:  -110.29952610721067
Mean Reward -99.5543918522592
Max reward so far:  91.80276966673995
Step 500
Step 1000
Step 1500
Step 2000
==========================================
Episode:  36
Reward:  -123.71219644014857
Mean Reward -100.20730548976972
Max reward so far:  91.80276966673995
Step 500
Step 1000
Step 1500
Step 2000
==========================================
Episode:  37
Reward:  -107.64420790596483
Mean Reward -100.40301344809065
Max reward so far:  91.80276966673995
==========================================
Episode:  38
Reward:  47.821486243673526
Mean Reward -96.60238525086592
Max reward so far:  91.80276966673995
Step 500
Step 1000
Step 1500
Step 2000
==========================================
Episode:  39
Reward:  -121.06963174700046
Mean Reward -97.21406641326928
Max reward so far:  91.80276966673995
Step 500
Step 1000
Step 1500
Step 2000
==========================================
Episode:  40
Reward:  -114.02004488185764
Mean Reward -97.62396832713729
Max reward so far:  91.80276966673995
Step 500
Step 1000
Step 1500
Step 2000
==========================================
Episode:  41
Reward:  -111.45807237022454
Mean Reward -97.9533517567346
Max reward so far:  91.80276966673995
Step 500
Step 1000
Step 1500
Step 2000
==========================================
Episode:  42
Reward:  -121.75049648104019
Mean Reward -98.50677372706731
Max reward so far:  91.80276966673995
Step 500
Step 1000
Step 2000
==========================================
Episode:  43
Reward:  -125.06575917057904
Mean Reward -99.11038703260168
Max reward so far:  91.80276966673995
Step 500
Step 1000
Step 1500
Step 2000
==========================================
Episode:  44
Reward:  -107.34010830541432
Mean Reward -99.29326972755305
Max reward so far:  91.80276966673995
Step 500
Step 1000
Step 1500
Step 2000
==========================================
Episode:  45
Reward:  -108.94161926872056
Mean Reward -99.50301645670888
Max reward so far:  91.80276966673995
Step 500
Step 1000
Step 1500
Step 2000
==========================================
Episode:  46
Reward:  -98.81166219793008
Mean Reward -99.48830679162846
Max reward so far:  91.80276966673995
Step 500
Step 1000
Step 1500
==========================================
Episode:  47
Reward:  27.807022265391673
Mean Reward -96.83632076960721
Max reward so far:  91.80276966673995
Step 500
Step 1000
Step 1500
==========================================
Episode:  48
Reward:  5.800446477137612
Mean Reward -94.74169286661242
Max reward so far:  91.80276966673995
Step 500
Step 1000
Step 1500
Step 2000
==========================================
Episode:  49
Reward:  -111.80097064975499
Mean Reward -95.08287842227529
Max reward so far:  91.80276966673995
Step 500
Step 1000
Step 1500
Step 2000
==========================================
Episode:  50
Reward:  -110.66167727256922
Mean Reward -95.38834506639868
Max reward so far:  91.80276966673995
Step 500
Step 1000
Step 1500
Step 2000
==========================================
Episode:  51
Reward:  -115.66139396214842
Mean Reward -95.77821139131696
Max reward so far:  91.80276966673995
Step 500
Step 1000
Step 1500
Step 2000
==========================================
Episode:  52
Reward:  -102.09435412606388
Mean Reward -95.89738389574615
Max reward so far:  91.80276966673995
Step 500
Step 1000
Step 1500
Step 2000
==========================================
Episode:  53
Reward:  -106.83161147241866
Mean Reward -96.09986959161044
Max reward so far:  91.80276966673995
==========================================
Episode:  54
Reward:  75.80520193155351
Mean Reward -92.97432283664382
Max reward so far:  91.80276966673995
Step 500
Step 1000
Step 1500
Step 2000
==========================================
Episode:  55
Reward:  -118.18593796710351
Mean Reward -93.42453024968775
Max reward so far:  91.80276966673995
Step 500
Step 1000
Step 1500
Step 2000
==========================================
Episode:  56
Reward:  -105.7996719296058
Mean Reward -93.64163799845824
Max reward so far:  91.80276966673995
Step 500
Step 1000
Step 1500
Step 2000
==========================================
Episode:  57
Reward:  -101.24425076696654
Mean Reward -93.77271752894977
Max reward so far:  91.80276966673995
Step 500
Step 1000
Step 1500
Step 2000
==========================================
Episode:  58
Reward:  -93.9809540788028
Mean Reward -93.77624696199813
Max reward so far:  91.80276966673995
Step 500
Step 1000
==========================================
Episode:  59
Reward:  20.826235643840747
Mean Reward -91.86620558523414
Max reward so far:  91.80276966673995
Step 500
Step 1000
==========================================
Episode:  60
Reward:  38.8027524581433
Mean Reward -89.72409151894927
Max reward so far:  91.80276966673995
Step 500
Step 1000
Step 1500
Step 2000
==========================================
Episode:  61
Reward:  -118.29765789733361
Mean Reward -90.18495549279417
Max reward so far:  91.80276966673995
Step 500
==========================================
Episode:  62
Reward:  74.80427751281026
Mean Reward -87.5660787784195
Max reward so far:  91.80276966673995
Step 500
Step 1000
Step 2000
==========================================
Episode:  63
Reward:  -112.0293738770311
Mean Reward -87.9483177643353
Max reward so far:  91.80276966673995
Step 500
Step 1000
Step 1500
==========================================
Episode:  64
Reward:  -107.07247998625998
Mean Reward -88.2425356446726
Max reward so far:  91.80276966673995
Step 500
Step 1000
Step 1500
Step 2000
==========================================
Episode:  65
Reward:  -98.07929469722686
Mean Reward -88.39157744849919
Max reward so far:  91.80276966673995
Step 500
==========================================
Episode:  66
Reward:  54.84345465416641
Mean Reward -86.2537411484594
Max reward so far:  91.80276966673995
Step 500
==========================================
Episode:  67
Reward:  55.81657204327149
Mean Reward -84.16447183681629
Max reward so far:  91.80276966673995
Step 500
Step 1000
==========================================
Episode:  68
Reward:  -114.64079847331308
Mean Reward -84.60615773009886
Max reward so far:  91.80276966673995
Step 500
Step 1000
Step 1500
Step 2000
==========================================
Episode:  69
Reward:  -92.26362217647798
Mean Reward -84.71555007933284
Max reward so far:  91.80276966673995
Step 500
Step 1000
Step 1500
==========================================
Episode:  70
Reward:  2.8132095145432885
Mean Reward -83.48275064843318
Max reward so far:  91.80276966673995
Step 500
==========================================
Episode:  71
Reward:  51.803088097951175
Mean Reward -81.60378066584451
Max reward so far:  91.80276966673995
Step 500
Step 1000
Step 1500
Step 2000
==========================================
Episode:  72
Reward:  -103.75339164732722
Mean Reward -81.90719999435798
Max reward so far:  91.80276966673995
Step 500
Step 1500
Step 2000
==========================================
Episode:  73
Reward:  -103.6891812185518
Mean Reward -82.20155109198222
Max reward so far:  91.80276966673995
Step 500
Step 1000
Step 1500
Step 2000
==========================================
Episode:  74
Reward:  -100.27226527871883
Mean Reward -82.44249394780537
Max reward so far:  91.80276966673995
Step 1000
Step 1500
Step 2000
==========================================
Episode:  75
Reward:  -112.05616486236323
Mean Reward -82.83214751247061
Max reward so far:  91.80276966673995
Step 1000
Step 1500
Step 2000
==========================================
Episode:  76
Reward:  -115.17545898959612
Mean Reward -83.25219051866705
Max reward so far:  91.80276966673995
Step 1000
Step 1500
Step 2000
==========================================
Episode:  77
Reward:  -104.66046150906655
Mean Reward -83.52665553136448
Max reward so far:  91.80276966673995
Step 500
Step 1000
Step 1500
Step 2000
==========================================
Episode:  78
Reward:  -114.41465806165705
Mean Reward -83.91764290516565
Max reward so far:  91.80276966673995
Step 500
Step 1000
Step 1500
Step 2000
==========================================
Episode:  79
Reward:  -97.98291384161115
Mean Reward -84.0934587918712
Max reward so far:  91.80276966673995
Step 500
Step 1000
Step 1500
Step 2000
==========================================
Episode:  80
Reward:  -92.16128688692247
Mean Reward -84.19306160785949
Max reward so far:  91.80276966673995
Step 500
Step 1000
Step 1500
Step 2000
==========================================
Episode:  81
Reward:  -88.11544815917934
Mean Reward -84.24089559019266
Max reward so far:  91.80276966673995
Step 500
Step 1000
Step 1500
Step 2000
==========================================
Episode:  82
Reward:  -108.87516079862631
Mean Reward -84.53769396619788
Max reward so far:  91.80276966673995
Step 500
Step 1000
Step 1500
Step 2000
==========================================
Episode:  83
Reward:  -105.08209188993423
Mean Reward -84.78227013195665
Max reward so far:  91.80276966673995
Step 500
Step 1000
Step 1500
Step 2000
==========================================
Episode:  84
Reward:  -113.05531343676432
Mean Reward -85.11489417083675
Max reward so far:  91.80276966673995
Step 500
Step 1000
Step 1500
Step 2000
==========================================
Episode:  85
Reward:  -118.95553528112595
Mean Reward -85.50838999770058
Max reward so far:  91.80276966673995
Step 500
Step 1000
Step 1500
Step 2000
==========================================
Episode:  86
Reward:  -99.96803772254286
Mean Reward -85.67459284511256
Max reward so far:  91.80276966673995
Step 500
Step 1000
Step 1500
Step 2000
==========================================
Episode:  87
Reward:  -100.04793686422809
Mean Reward -85.83792629987522
Max reward so far:  91.80276966673995
Step 500
Step 1500
Step 2000
==========================================
Episode:  88
Reward:  -94.69702001108337
Mean Reward -85.93746667865284
Max reward so far:  91.80276966673995
Step 500
Step 1000
Step 1500
Step 2000
==========================================
Episode:  89
Reward:  -93.14422000550053
Mean Reward -86.01754171561782
Max reward so far:  91.80276966673995
Step 500
Step 1000
Step 1500
Step 2000
==========================================
Episode:  90
Reward:  -92.67061259545287
Mean Reward -86.09065238462699
Max reward so far:  91.80276966673995
Step 1000
Step 1500
Step 2000
==========================================
Episode:  91
Reward:  -93.14929269127863
Mean Reward -86.16737673578625
Max reward so far:  91.80276966673995
Step 500
Step 1000
Step 1500
Step 2000
==========================================
Episode:  92
Reward:  -79.35015602928917
Mean Reward -86.0940732873293
Max reward so far:  91.80276966673995
Step 500
Step 1000
Step 1500
Step 2000
==========================================
Episode:  93
Reward:  -87.26981191980704
Mean Reward -86.10658114512161
Max reward so far:  91.80276966673995
Step 500
Step 1000
Step 1500
==========================================
Episode:  94
Reward:  -92.17159420580586
Mean Reward -86.17042338786565
Max reward so far:  91.80276966673995
Step 500
Step 1000
Step 1500
Step 2000
==========================================
Episode:  95
Reward:  -90.88260560626479
Mean Reward -86.2195086193073
Max reward so far:  91.80276966673995
Step 1000
Step 1500
Step 2000
==========================================
Episode:  96
Reward:  -85.11453459255208
Mean Reward -86.2081171344954
Max reward so far:  91.80276966673995
Step 500
Step 1000
Step 1500
==========================================
Episode:  97
Reward:  -96.91004698605964
Mean Reward -86.3173205003277
Max reward so far:  91.80276966673995
Step 500
Step 1000
==========================================
Episode:  98
Reward:  35.80085967212243
Mean Reward -85.08380352888881
Max reward so far:  91.80276966673995
Step 500
Step 1000
Step 1500
Step 2000
==========================================
Episode:  99
Reward:  -97.15257573270863
Mean Reward -85.204491250927
Max reward so far:  91.80276966673995
Step 500
Step 1000
Step 1500
Step 2000
==========================================
Episode:  100
Reward:  -87.05404027953108
Mean Reward -85.22280361754684
Max reward so far:  91.80276966673995
Model saved. Also written some other stats...
Step 500
Step 1000
Step 1500
Step 2000
==========================================
Episode:  101
Reward:  -80.65912086583673
Mean Reward -85.17806162978498
Max reward so far:  91.80276966673995
Step 500
==========================================
Episode:  102
Reward:  49.801370865677804
Mean Reward -83.86758170264456
Max reward so far:  91.80276966673995
Step 500
Step 1500
==========================================
Episode:  103
Reward:  -2.1987317984326467
Mean Reward -83.08230429971944
Max reward so far:  91.80276966673995
Step 1000
Step 1500
Step 2000
==========================================
Episode:  104
Reward:  -86.88489452970558
Mean Reward -83.11851944476692
Max reward so far:  91.80276966673995
Step 500
Step 1000
Step 1500
==========================================
Episode:  105
Reward:  -99.71262272114251
Mean Reward -83.27506758888367
Max reward so far:  91.80276966673995
Step 500
Step 1000
Step 2000
==========================================
Episode:  106
Reward:  -86.84113839101477
Mean Reward -83.30839535338957
Max reward so far:  91.80276966673995
Step 500
Step 1000
Step 1500
Step 2000
==========================================
Episode:  107
Reward:  -87.05621833669085
Mean Reward -83.34309741804977
Max reward so far:  91.80276966673995
==========================================
Episode:  108
Reward:  85.80598284554313
Mean Reward -81.79127099361314
Max reward so far:  91.80276966673995
Step 500
Step 1000
Step 1500
Step 2000
==========================================
Episode:  109
Reward:  -95.99074049719684
Mean Reward -81.92035708000935
Max reward so far:  91.80276966673995
Step 500
==========================================
Episode:  110
Reward:  72.80676490110665
Mean Reward -80.52641904414345
Max reward so far:  91.80276966673995
Step 500
Step 1000
Step 1500
Step 2000
==========================================
Episode:  111
Reward:  -84.64795273980967
Mean Reward -80.56321845214048
Max reward so far:  91.80276966673995
Step 500
Step 1000
Step 1500
==========================================
Episode:  112
Reward:  16.80513473932809
Mean Reward -79.70155160973809
Max reward so far:  91.80276966673995
Step 500
Step 1000
Step 2000
==========================================
Episode:  113
Reward:  -107.02490407230118
Mean Reward -79.94123014011144
Max reward so far:  91.80276966673995
==========================================
Episode:  114
Reward:  71.8104892402427
Mean Reward -78.62164997158663
Max reward so far:  91.80276966673995
Step 500
Step 1000
Step 1500
==========================================
Episode:  115
Reward:  -84.98729095524692
Mean Reward -78.67652618696302
Max reward so far:  91.80276966673995
Step 500
Step 1000
Step 1500
==========================================
Episode:  116
Reward:  16.801190125018493
Mean Reward -77.86047732959564
Max reward so far:  91.80276966673995
Step 500
Step 1000
==========================================
Episode:  117
Reward:  56.8211097879458
Mean Reward -76.71910794724359
Max reward so far:  91.80276966673995
Step 500
Step 1000
Step 1500
Step 2000
==========================================
Episode:  118
Reward:  -82.85137588118022
Mean Reward -76.77063961055399
Max reward so far:  91.80276966673995
Step 500
Step 1000
Step 1500
Step 2000
==========================================
Episode:  119
Reward:  -84.64887170141756
Mean Reward -76.83629154464452
Max reward so far:  91.80276966673995
Step 500
Step 1000
==========================================
Episode:  120
Reward:  43.80041286503317
Mean Reward -75.83929398753975
Max reward so far:  91.80276966673995
Step 500
Step 1000
Step 1500
Step 2000
==========================================
Episode:  121
Reward:  -74.66069145569172
Mean Reward -75.8296333110492
Max reward so far:  91.80276966673995
Step 500
Step 1000
Step 1500
Step 2000
==========================================
Episode:  122
Reward:  -82.82095422628046
Mean Reward -75.8864733184901
Max reward so far:  91.80276966673995
Step 500
Step 1000
Step 1500
Step 2000
==========================================
Episode:  123
Reward:  -84.28850122014848
Mean Reward -75.9542316080196
Max reward so far:  91.80276966673995
Step 500
Step 1500
==========================================
Episode:  124
Reward:  22.804313942732307
Mean Reward -75.16416324361359
Max reward so far:  91.80276966673995
Step 500
Step 1000
Step 1500
Step 2000
==========================================
Episode:  125
Reward:  -79.67536779445068
Mean Reward -75.19996645433451
Max reward so far:  91.80276966673995
Step 500
Step 1000
Step 1500
Step 2000
==========================================
Episode:  126
Reward:  -79.67158833498124
Mean Reward -75.23517607544197
Max reward so far:  91.80276966673995
Step 500
Step 1000
Step 1500
Step 2000
==========================================
Episode:  127
Reward:  -85.80857133931443
Mean Reward -75.31778072594096
Max reward so far:  91.80276966673995
Step 500
Step 1000
Step 1500
Step 2000
==========================================
Episode:  128
Reward:  -80.66396037932267
Mean Reward -75.35922397906796
Max reward so far:  91.80276966673995
Step 500
Step 1000
Step 1500
Step 2000
==========================================
Episode:  129
Reward:  -87.84849548188988
Mean Reward -75.45529529832045
Max reward so far:  91.80276966673995
Step 500
Step 1000
Step 1500
Step 2000
==========================================
Episode:  130
Reward:  -75.87800766476319
Mean Reward -75.45852211027803
Max reward so far:  91.80276966673995
Step 500
Step 1000
Step 1500
Step 2000
==========================================
Episode:  131
Reward:  -86.072125705498
Mean Reward -75.5389281981206
Max reward so far:  91.80276966673995
Step 500
Step 1000
Step 1500
Step 2000
==========================================
Episode:  132
Reward:  -76.11779992342665
Mean Reward -75.54328061710787
Max reward so far:  91.80276966673995
Step 500
Step 1000
Step 1500
Step 2000
==========================================
Episode:  133
Reward:  -80.0898865217284
Mean Reward -75.57721051191847
Max reward so far:  91.80276966673995
Step 500
Step 1000
Step 1500
Step 2000
==========================================
Episode:  134
Reward:  -78.09778605697807
Mean Reward -75.59588144188189
Max reward so far:  91.80276966673995
Step 500
Step 1000
Step 1500
==========================================
Episode:  135
Reward:  27.83665812002122
Mean Reward -74.83534806275023
Max reward so far:  91.80276966673995
Step 500
Step 1000
Step 1500
Step 2000
==========================================
Episode:  136
Reward:  -79.85046849592175
Mean Reward -74.87195478124053
Max reward so far:  91.80276966673995
Step 500
==========================================
Episode:  137
Reward:  77.80970097846105
Mean Reward -73.76556597138762
Max reward so far:  91.80276966673995
Step 500
Step 1500
Step 2000
==========================================
Episode:  138
Reward:  -98.08045410403712
Mean Reward -73.9404932241405
Max reward so far:  91.80276966673995
Step 500
==========================================
Episode:  139
Reward:  64.8290453363683
Mean Reward -72.94928223442257
Max reward so far:  91.80276966673995
Step 500
Step 1000
Step 2000
==========================================
Episode:  140
Reward:  -396.58277619261344
Mean Reward -75.24455524121826
Max reward so far:  91.80276966673995
Step 500
Step 1000
Step 1500
==========================================
Episode:  141
Reward:  -82.68128287134587
Mean Reward -75.29692656255719
Max reward so far:  91.80276966673995
Step 500
Step 1000
Step 1500
Step 2000
==========================================
Episode:  142
Reward:  -78.28101649026007
Mean Reward -75.31779432428938
Max reward so far:  91.80276966673995
Step 500
Step 1000
==========================================
Episode:  143
Reward:  56.80194559441262
Mean Reward -74.40029613040949
Max reward so far:  91.80276966673995
Step 500
Step 1000
Step 1500
Step 2000
==========================================
Episode:  144
Reward:  -74.09102867828506
Mean Reward -74.39816325142932
Max reward so far:  91.80276966673995
Step 500
Step 1000
Step 1500
Step 2000
==========================================
Episode:  145
Reward:  -76.98858783438513
Mean Reward -74.41590588555916
Max reward so far:  91.80276966673995
Step 500
Step 1000
Step 1500
Step 2000
==========================================
Episode:  146
Reward:  -202.6113345856428
Mean Reward -75.28798363181824
Max reward so far:  91.80276966673995
Step 500
Step 1000
Step 1500
Step 2000
==========================================
Episode:  147
Reward:  -79.01919111786546
Mean Reward -75.31319449321045
Max reward so far:  91.80276966673995
Step 500
==========================================
Episode:  148
Reward:  79.81202156212753
Mean Reward -74.27208566062428
Max reward so far:  91.80276966673995
==========================================
Episode:  149
Reward:  81.83319307041873
Mean Reward -73.23138380241733
Max reward so far:  91.80276966673995
Step 500
Step 1000
Step 1500
Step 2000
==========================================
Episode:  150
Reward:  -77.19397485346948
Mean Reward -73.25762612725873
Max reward so far:  91.80276966673995
Step 500
Step 1000
Step 1500
Step 2000
==========================================
Episode:  151
Reward:  -85.0183541952681
Mean Reward -73.33499933823248
Max reward so far:  91.80276966673995
Step 500
Step 1000
Step 1500
Step 2000
==========================================
Episode:  152
Reward:  -87.03364745065167
Mean Reward -73.42453298602608
Max reward so far:  91.80276966673995
Step 500
Step 1000
Step 1500
Step 2000
==========================================
Episode:  153
Reward:  -77.78995463640565
Mean Reward -73.45287987985972
Max reward so far:  91.80276966673995
Step 500
Step 1000
Step 1500
==========================================
Episode:  154
Reward:  -76.70540906147494
Mean Reward -73.47386393909593
Max reward so far:  91.80276966673995
Step 500
==========================================
Episode:  155
Reward:  73.8024174987066
Mean Reward -72.52978521193053
Max reward so far:  91.80276966673995
Step 1000
==========================================
Episode:  156
Reward:  -441.005614245804
Mean Reward -74.87676501469406
Max reward so far:  91.80276966673995
Step 500
Step 1000
Step 1500
Step 2000
==========================================
Episode:  157
Reward:  -75.70602363220814
Mean Reward -74.88201348695682
Max reward so far:  91.80276966673995
Step 500
Step 1000
Step 1500
Step 2000
==========================================
Episode:  158
Reward:  -82.32318835202281
Mean Reward -74.92881332887546
Max reward so far:  91.80276966673995
Step 500
Step 1000
Step 1500
Step 2000
==========================================
Episode:  159
Reward:  -79.0160716643073
Mean Reward -74.9543586934719
Max reward so far:  91.80276966673995
Step 500
Step 1000
Step 1500
Step 2000
==========================================
Episode:  160
Reward:  -83.68549892453885
Mean Reward -75.0085893781369
Max reward so far:  91.80276966673995
Step 500
Step 1000
Step 2000
==========================================
Episode:  161
Reward:  -76.0602568806113
Mean Reward -75.01508115284355
Max reward so far:  91.80276966673995
Step 500
Step 1000
==========================================
Episode:  162
Reward:  47.816261408797175
Mean Reward -74.26151463406048
Max reward so far:  91.80276966673995
Step 500
Step 1000
Step 1500
Step 2000
==========================================
Episode:  163
Reward:  -85.23914398752956
Mean Reward -74.3284513984109
Max reward so far:  91.80276966673995
Step 500
Step 1000
Step 1500
Step 2000
==========================================
Episode:  164
Reward:  -75.02643060129827
Mean Reward -74.3326815753981
Max reward so far:  91.80276966673995
Step 500
Step 1000
Step 1500
Step 2000
==========================================
Episode:  165
Reward:  -104.64585781822596
Mean Reward -74.51529107083681
Max reward so far:  91.80276966673995
Step 500
Step 1000
Step 1500
Step 2000
==========================================
Episode:  166
Reward:  -83.65098933218806
Mean Reward -74.5699958508449
Max reward so far:  91.80276966673995
Step 500
Step 1000
Step 1500
==========================================
Episode:  167
Reward:  -80.30239517049185
Mean Reward -74.60411727536662
Max reward so far:  91.80276966673995
Step 500
Step 1000
Step 1500
Step 2000
==========================================
Episode:  168
Reward:  -80.00701075129655
Mean Reward -74.63608705924786
Max reward so far:  91.80276966673995
Step 500
Step 1000
Step 1500
Step 2000
==========================================
Episode:  169
Reward:  -277.6206070182625
Mean Reward -75.83011364724206
Max reward so far:  91.80276966673995
Step 500
Step 1000
Step 1500
Step 2000
==========================================
Episode:  170
Reward:  -75.11389121271208
Mean Reward -75.82592521195242
Max reward so far:  91.80276966673995
Step 500
Step 1000
Step 1500
Step 2000
==========================================
Episode:  171
Reward:  -71.83716785765479
Mean Reward -75.80273476221814
Max reward so far:  91.80276966673995
Step 500
Step 1000
Step 1500
Step 2000
==========================================
Episode:  172
Reward:  -78.2833287109051
Mean Reward -75.81707345556313
Max reward so far:  91.80276966673995
Step 500
Step 1000
Step 1500
Step 2000
==========================================
Episode:  173
Reward:  -70.08770263505346
Mean Reward -75.78414603705446
Max reward so far:  91.80276966673995
Step 500
Step 1000
Step 1500
==========================================
Episode:  174
Reward:  -259.5736374359118
Mean Reward -76.8343717021908
Max reward so far:  91.80276966673995
Step 500
Step 1000
Step 1500
Step 2000
==========================================
Episode:  175
Reward:  -82.89181681732342
Mean Reward -76.86878900398132
Max reward so far:  91.80276966673995
Step 500
Step 1000
Step 1500
Step 2000
==========================================
Episode:  176
Reward:  -74.0864658082935
Mean Reward -76.85306966389268
Max reward so far:  91.80276966673995
Step 500
Step 1000
Step 1500
Step 2000
==========================================
Episode:  177
Reward:  -78.9518920430619
Mean Reward -76.86486080085432
Max reward so far:  91.80276966673995
==========================================
Episode:  178
Reward:  85.80276882715198
Mean Reward -75.95610309343527
Max reward so far:  91.80276966673995
Step 500
Step 1500
Step 2000
==========================================
Episode:  179
Reward:  -73.28714536651856
Mean Reward -75.94127555050795
Max reward so far:  91.80276966673995
Step 500
Step 1000
Step 1500
Step 2000
==========================================
Episode:  180
Reward:  -86.6170102001095
Mean Reward -76.00025750989803
Max reward so far:  91.80276966673995
Step 500
Step 1000
Step 1500
Step 2000
==========================================
Episode:  181
Reward:  -87.70156289961261
Mean Reward -76.0645503966547
Max reward so far:  91.80276966673995
Step 500
Step 1000
Step 1500
Step 2000
==========================================
Episode:  182
Reward:  -69.78295789534863
Mean Reward -76.03022475457105
Max reward so far:  91.80276966673995
Step 500
Step 1000
Step 1500
Step 2000
==========================================
Episode:  183
Reward:  -102.09596248931977
Mean Reward -76.17188637269469
Max reward so far:  91.80276966673995
Step 500
Step 1000
Step 1500
Step 2000
==========================================
Episode:  184
Reward:  -75.63979033416115
Mean Reward -76.16901017789182
Max reward so far:  91.80276966673995
Step 500
Step 1000
Step 1500
Step 2000
==========================================
Episode:  185
Reward:  -79.20057273067889
Mean Reward -76.1853089012939
Max reward so far:  91.80276966673995
Step 500
Step 1000
Step 1500
Step 2000
==========================================
Episode:  186
Reward:  -72.10335813949382
Mean Reward -76.16348028759442
Max reward so far:  91.80276966673995
Step 500
Step 1000
Step 1500
Step 2000
==========================================
Episode:  187
Reward:  -77.74618146266542
Mean Reward -76.17189891086608
Max reward so far:  91.80276966673995
Step 500
Step 1000
Step 1500
Step 2000
==========================================
Episode:  188
Reward:  -75.71364893456251
Mean Reward -76.16947430781686
Max reward so far:  91.80276966673995
Step 500
Step 1000
Step 1500
==========================================
Episode:  189
Reward:  -84.67803030909002
Mean Reward -76.21425618150776
Max reward so far:  91.80276966673995
Step 500
Step 1000
Step 1500
Step 2000
==========================================
Episode:  190
Reward:  -75.29671973111682
Mean Reward -76.20945232574655
Max reward so far:  91.80276966673995
Step 500
Step 1000
Step 1500
==========================================
Episode:  191
Reward:  -75.74355405789797
Mean Reward -76.20702577226818
Max reward so far:  91.80276966673995
Step 500
Step 1000
Step 1500
Step 2000
==========================================
Episode:  192
Reward:  -76.3635477082718
Mean Reward -76.20783676675524
Max reward so far:  91.80276966673995
Step 500
Step 1000
Step 1500
Step 2000
==========================================
Episode:  193
Reward:  -71.97762475930084
Mean Reward -76.18603155022197
Max reward so far:  91.80276966673995
Step 500
Step 1000
Step 1500
Step 2000
==========================================
Episode:  194
Reward:  -70.2684361888023
Mean Reward -76.15568490734289
Max reward so far:  91.80276966673995
Step 500
Step 1000
Step 1500
Step 2000
==========================================
Episode:  195
Reward:  -70.08313289203247
Mean Reward -76.12470249910152
Max reward so far:  91.80276966673995
Step 500
Step 1000
Step 2000
==========================================
Episode:  196
Reward:  -73.00897830466903
Mean Reward -76.10888664024652
Max reward so far:  91.80276966673995
Step 500
Step 1000
Step 1500
Step 2000
==========================================
Episode:  197
Reward:  -77.32325119969153
Mean Reward -76.11501979458716
Max reward so far:  91.80276966673995
Step 500
Step 1000
Step 1500
Step 2000
==========================================
Episode:  198
Reward:  -68.1882836704863
Mean Reward -76.07518694974243
Max reward so far:  91.80276966673995
Step 500
Step 1000
Step 1500
Step 2000
==========================================
Episode:  199
Reward:  -75.67793204886453
Mean Reward -76.07320067523804
Max reward so far:  91.80276966673995
Step 500
Step 1000
Step 1500
Step 2000
==========================================
Episode:  200
Reward:  -73.00232597341406
Mean Reward -76.05792269164688
Max reward so far:  91.80276966673995
Model saved. Also written some other stats...
Step 1000
Step 1500
Step 2000
==========================================
Episode:  201
Reward:  -72.22350738220965
Mean Reward -76.03894043763977
Max reward so far:  91.80276966673995
Step 500
Step 1000
Step 1500
Step 2000
==========================================
Episode:  202
Reward:  -73.81018530742358
Mean Reward -76.02796134832835
Max reward so far:  91.80276966673995
Step 1000
Step 2000
==========================================
Episode:  203
Reward:  -74.11866133532743
Mean Reward -76.01860203453913
Max reward so far:  91.80276966673995
Step 500
Step 1000
Step 1500
Step 2000
==========================================
Episode:  204
Reward:  -76.66307449837805
Mean Reward -76.02174580265542
Max reward so far:  91.80276966673995
Step 500
Step 1000
Step 1500
==========================================
Episode:  205
Reward:  -75.35201049046573
Mean Reward -76.01849466036323
Max reward so far:  91.80276966673995
Step 1000
Step 1500
Step 2000
==========================================
Episode:  206
Reward:  -69.22653685742787
Mean Reward -75.9856832700109
Max reward so far:  91.80276966673995
Step 500
Step 1000
Step 1500
Step 2000
==========================================
Episode:  207
Reward:  -75.97393724169488
Mean Reward -75.9856267987209
Max reward so far:  91.80276966673995
Step 500
Step 1000
Step 1500
Step 2000
==========================================
Episode:  208
Reward:  -71.06392433449125
Mean Reward -75.96207798310259
Max reward so far:  91.80276966673995
Step 500
Step 1000
Step 1500
Step 2000
==========================================
Episode:  209
Reward:  -71.12070606213896
Mean Reward -75.939023831098
Max reward so far:  91.80276966673995
Step 500
Step 1000
Step 1500
Step 2000
==========================================
Episode:  210
Reward:  -66.19449345986101
Mean Reward -75.89284122270351
Max reward so far:  91.80276966673995
Step 500
==========================================
Episode:  211
Reward:  72.81275213767175
Mean Reward -75.19139974458852
Max reward so far:  91.80276966673995
Step 500
Step 1000
Step 1500
Step 2000
==========================================
Episode:  212
Reward:  -77.00658768153875
Mean Reward -75.19992175368219
Max reward so far:  91.80276966673995
Step 500
Step 1000
Step 1500
Step 2000
==========================================
Episode:  213
Reward:  -66.92007768597837
Mean Reward -75.16123089355273
Max reward so far:  91.80276966673995
Step 500
Step 1000
Step 1500
Step 2000
==========================================
Episode:  214
Reward:  -74.64293413662546
Mean Reward -75.15882021096238
Max reward so far:  91.80276966673995
Step 500
Step 1000
Step 1500
Step 2000
==========================================
Episode:  215
Reward:  -69.06140910684377
Mean Reward -75.13059145585072
Max reward so far:  91.80276966673995
Step 500
Step 1000
Step 1500
==========================================
Episode:  216
Reward:  -75.75847298744013
Mean Reward -75.13348491912993
Max reward so far:  91.80276966673995
Step 500
Step 1000
Step 1500
Step 2000
==========================================
Episode:  217
Reward:  -67.80084515068452
Mean Reward -75.09984895688936
Max reward so far:  91.80276966673995
Step 500
Step 1000
Step 1500
Step 2000
==========================================
Episode:  218
Reward:  -65.63981183502992
Mean Reward -75.05665244035119
Max reward so far:  91.80276966673995
Step 1000
Step 1500
Step 2000
==========================================
Episode:  219
Reward:  -73.0935119971489
Mean Reward -75.04772907470026
Max reward so far:  91.80276966673995
Step 500
Step 1000
Step 1500
Step 2000
==========================================
Episode:  220
Reward:  -77.66303636545753
Mean Reward -75.0595630443417
Max reward so far:  91.80276966673995
Step 500
Step 1000
Step 1500
Step 2000
==========================================
Episode:  221
Reward:  -70.0422034592089
Mean Reward -75.03696232548975
Max reward so far:  91.80276966673995
Step 500
Step 1000
Step 1500
Step 2000
==========================================
Episode:  222
Reward:  -70.094208681999
Mean Reward -75.01479751094494
Max reward so far:  91.80276966673995
Step 500
Step 1000
Step 1500
Step 2000
==========================================
Episode:  223
Reward:  -70.74273779338105
Mean Reward -74.99572581577726
Max reward so far:  91.80276966673995
Step 500
Step 1000
Step 1500
Step 2000
==========================================
Episode:  224
Reward:  -74.67778117855259
Mean Reward -74.99431272850072
Max reward so far:  91.80276966673995
Step 500
Step 1000
Step 1500
Step 2000
==========================================
Episode:  225
Reward:  -73.18444772639631
Mean Reward -74.986304476279
Max reward so far:  91.80276966673995
Step 500
Step 1000
Step 1500
Step 2000
==========================================
Episode:  226
Reward:  -72.08590454225312
Mean Reward -74.97352738405863
Max reward so far:  91.80276966673995
Step 500
Step 1000
Step 1500
Step 2000
==========================================
Episode:  227
Reward:  -70.05176944761882
Mean Reward -74.95194072644266
Max reward so far:  91.80276966673995
Step 500
Step 1000
Step 1500
Step 2000
==========================================
Episode:  228
Reward:  -73.92610519893202
Mean Reward -74.94746109531816
Max reward so far:  91.80276966673995
Step 500
Step 1000
Step 1500
Step 2000
==========================================
Episode:  229
Reward:  -70.09005647372916
Mean Reward -74.92634194478951
Max reward so far:  91.80276966673995
Step 500
Step 1000
Step 1500
Step 2000
==========================================
Episode:  230
Reward:  -74.68569209359518
Mean Reward -74.92530017054192
Max reward so far:  91.80276966673995
Step 500
Step 1000
Step 1500
Step 2000
==========================================
Episode:  231
Reward:  -67.03144333440007
Mean Reward -74.89127492555855
Max reward so far:  91.80276966673995
Step 500
Step 1000
Step 1500
Step 2000
==========================================
Episode:  232
Reward:  -400.6737044289909
Mean Reward -76.2894827775046
Max reward so far:  91.80276966673995
Step 500
Step 1000
Step 1500
Step 2000
==========================================
Episode:  233
Reward:  -69.97074296110227
Mean Reward -76.26247961589605
Max reward so far:  91.80276966673995
Step 500
Step 1000
Step 1500
Step 2000
==========================================
Episode:  234
Reward:  -71.72853928281705
Mean Reward -76.24318625277655
Max reward so far:  91.80276966673995
Step 500
Step 1000
Step 1500
Step 2000
==========================================
Episode:  235
Reward:  -65.66035125454373
Mean Reward -76.19834373159762
Max reward so far:  91.80276966673995
Step 500
Step 1000
Step 1500
Step 2000
==========================================
Episode:  236
Reward:  -72.06907090686609
Mean Reward -76.18092063951015
Max reward so far:  91.80276966673995
Step 500
Step 1000
Step 1500
Step 2000
==========================================
Episode:  237
Reward:  -71.071264590507
Mean Reward -76.1594514964471
Max reward so far:  91.80276966673995
Step 500
Step 1500
Step 2000
==========================================
Episode:  238
Reward:  -65.18499946105626
Mean Reward -76.113533287094
Max reward so far:  91.80276966673995
Step 500
Step 1000
Step 1500
Step 2000
==========================================
Episode:  239
Reward:  -74.80316807762937
Mean Reward -76.10807343205457
Max reward so far:  91.80276966673995
Step 500
Step 1000
Step 1500
Step 2000
==========================================
Episode:  240
Reward:  -61.92624437210448
Mean Reward -76.04922766832033
Max reward so far:  91.80276966673995
Step 500
Step 1000
Step 1500
Step 2000
==========================================
Episode:  241
Reward:  -71.87655873327816
Mean Reward -76.03198523470444
Max reward so far:  91.80276966673995
Step 500
Step 1000
Step 1500
Step 2000
==========================================
Episode:  242
Reward:  -66.08894726531616
Mean Reward -75.99106738297857
Max reward so far:  91.80276966673995
Step 500
Step 1000
Step 1500
Step 2000
==========================================
Episode:  243
Reward:  -71.15937742187016
Mean Reward -75.97126537494124
Max reward so far:  91.80276966673995
Step 500
Step 1000
Step 1500
Step 2000
==========================================
Episode:  244
Reward:  -72.1121773646299
Mean Reward -75.95551399530733
Max reward so far:  91.80276966673995
Step 500
Step 1000
Step 1500
Step 2000
==========================================
Episode:  245
Reward:  -67.78502119532133
Mean Reward -75.92230060994153
Max reward so far:  91.80276966673995
Step 500
Step 1000
Step 1500
Step 2000
==========================================
Episode:  246
Reward:  -69.17350624184681
Mean Reward -75.89497755581968
Max reward so far:  91.80276966673995
Step 500
Step 1000
Step 1500
Step 2000
==========================================
Episode:  247
Reward:  -65.87996207492537
Mean Reward -75.8545944288806
Max reward so far:  91.80276966673995
Step 500
Step 1000
Step 1500
Step 2000
==========================================
Episode:  248
Reward:  -66.68659395878791
Mean Reward -75.81777514988424
Max reward so far:  91.80276966673995
Step 500
Step 1000
Step 1500
Step 2000
==========================================
Episode:  249
Reward:  -61.95987393895061
Mean Reward -75.7623435450405
Max reward so far:  91.80276966673995
Step 500
Step 1000
Step 2000
==========================================
Episode:  250
Reward:  -63.95768753681228
Mean Reward -75.71531304301568
Max reward so far:  91.80276966673995
Step 500
Step 1000
Step 1500
==========================================
Episode:  251
Reward:  -66.88694865395696
Mean Reward -75.6802798509956
Max reward so far:  91.80276966673995
Step 500
Step 1000
Step 1500
Step 2000
==========================================
Episode:  252
Reward:  -73.67631604452384
Mean Reward -75.67235904543642
Max reward so far:  91.80276966673995
Step 500
Step 1000
Step 1500
Step 2000
==========================================
Episode:  253
Reward:  -63.107774329452035
Mean Reward -75.62289217647586
Max reward so far:  91.80276966673995
Step 500
Step 1000
Step 1500
Step 2000
==========================================
Episode:  254
Reward:  -62.661146621005415
Mean Reward -75.57206180174852
Max reward so far:  91.80276966673995
Step 500
Step 1000
Step 1500
Step 2000
==========================================
Episode:  255
Reward:  -68.1179225747972
Mean Reward -75.54294407039325
Max reward so far:  91.80276966673995
Step 500
Step 1000
Step 1500
Step 2000
==========================================
Episode:  256
Reward:  -64.65625370778659
Mean Reward -75.50058340750373
Max reward so far:  91.80276966673995
Step 500
Step 1000
Step 1500
Step 2000
==========================================
Episode:  257
Reward:  -68.09798677445696
Mean Reward -75.47189117249192
Max reward so far:  91.80276966673995
Step 500
Step 1000
Step 1500
Step 2000
==========================================
Episode:  258
Reward:  -70.98874088368736
Mean Reward -75.45458171191738
Max reward so far:  91.80276966673995
Step 500
Step 1000
Step 1500
Step 2000
==========================================
Episode:  259
Reward:  -65.76305249856375
Mean Reward -75.41730659955834
Max reward so far:  91.80276966673995
Step 500
Step 1000
Step 1500
Step 2000
==========================================
Episode:  260
Reward:  -74.81839838275265
Mean Reward -75.41501193206099
Max reward so far:  91.80276966673995
Step 500
Step 1000
Step 1500
Step 2000
==========================================
Episode:  261
Reward:  -73.15591174224153
Mean Reward -75.40638941225252
Max reward so far:  91.80276966673995
Step 500
Step 1000
Step 2000
==========================================
Episode:  262
Reward:  -72.65242035464584
Mean Reward -75.39591804701448
Max reward so far:  91.80276966673995
Step 500
Step 1000
Step 1500
Step 2000
==========================================
Episode:  263
Reward:  -75.8070533150372
Mean Reward -75.39747537757516
Max reward so far:  91.80276966673995
Step 500
Step 1000
Step 1500
Step 2000
==========================================
Episode:  264
Reward:  -70.07924773497675
Mean Reward -75.3774065940182
Max reward so far:  91.80276966673995
Step 500
Step 1000
Step 1500
Step 2000
==========================================
Episode:  265
Reward:  -71.87558737079326
Mean Reward -75.36424186009629
Max reward so far:  91.80276966673995
Step 500
Step 1000
Step 1500
Step 2000
==========================================
Episode:  266
Reward:  -66.81859802100976
Mean Reward -75.3322357033956
Max reward so far:  91.80276966673995
Step 500
Step 1000
Step 1500
Step 2000
==========================================
Episode:  267
Reward:  -73.07601044179863
Mean Reward -75.32381695241948
Max reward so far:  91.80276966673995
Step 500
Step 1000
Step 1500
==========================================
Episode:  268
Reward:  -64.81181228501626
Mean Reward -75.28473886815405
Max reward so far:  91.80276966673995
Step 500
Step 1000
Step 1500
Step 2000
==========================================
Episode:  269
Reward:  -67.89518675236152
Mean Reward -75.25737015661407
Max reward so far:  91.80276966673995
Step 500
Step 1000
Step 1500
Step 2000
==========================================
Episode:  270
Reward:  -63.84570470456322
Mean Reward -75.21526069000136
Max reward so far:  91.80276966673995
Step 500
Step 1500
Step 2000
==========================================
Episode:  271
Reward:  -70.14471021696353
Mean Reward -75.19661896032106
Max reward so far:  91.80276966673995
Step 500
==========================================
Episode:  272
Reward:  83.83925460447398
Mean Reward -74.61406997290423
Max reward so far:  91.80276966673995
Step 500
Step 1000
Step 1500
Step 2000
==========================================
Episode:  273
Reward:  -66.88832685435055
Mean Reward -74.58587383013578
Max reward so far:  91.80276966673995
Step 500
Step 1000
Step 1500
Step 2000
==========================================
Episode:  274
Reward:  -62.79422764498334
Mean Reward -74.54299511673523
Max reward so far:  91.80276966673995
Step 500
Step 1000
Step 1500
Step 2000
==========================================
Episode:  275
Reward:  -59.798626916268965
Mean Reward -74.4895734928205
Max reward so far:  91.80276966673995
Step 500
Step 1000
==========================================
Episode:  276
Reward:  55.8011937820899
Mean Reward -74.01920971204466
Max reward so far:  91.80276966673995
Step 500
Step 1000
Step 1500
Step 2000
==========================================
Episode:  277
Reward:  -68.3513465302934
Mean Reward -73.99882171498798
Max reward so far:  91.80276966673995
Step 500
Step 1000
Step 1500
Step 2000
==========================================
Episode:  278
Reward:  -69.33791827233028
Mean Reward -73.98211596788168
Max reward so far:  91.80276966673995
Step 500
Step 1000
Step 1500
Step 2000
==========================================
Episode:  279
Reward:  -73.73061559768067
Mean Reward -73.98121775227384
Max reward so far:  91.80276966673995
Step 500
Step 1000
Step 1500
==========================================
Episode:  280
Reward:  -64.09226183094894
Mean Reward -73.94602573831894
Max reward so far:  91.80276966673995
Step 500
Step 1000
Step 1500
==========================================
Episode:  281
Reward:  -65.69782186186553
Mean Reward -73.91677678840243
Max reward so far:  91.80276966673995
Step 500
Step 1000
Step 1500
Step 2000
==========================================
Episode:  282
Reward:  -63.08439357672947
Mean Reward -73.87849981592302
Max reward so far:  91.80276966673995
Step 500
Step 1000
Step 1500
Step 2000
==========================================
Episode:  283
Reward:  -67.8125816079486
Mean Reward -73.85714094899355
Max reward so far:  91.80276966673995
Step 500
Step 1000
Step 1500
Step 2000
==========================================
Episode:  284
Reward:  -68.71346775471562
Mean Reward -73.83909297287326
Max reward so far:  91.80276966673995
Step 500
Step 1000
Step 1500
Step 2000
==========================================
Episode:  285
Reward:  -60.81646070657867
Mean Reward -73.79355929362048
Max reward so far:  91.80276966673995
Step 1000
Step 1500
Step 2000
==========================================
Episode:  286
Reward:  -456.68008372610166
Mean Reward -75.12765868188697
Max reward so far:  91.80276966673995
Step 500
Step 1000
Step 1500
Step 2000
==========================================
Episode:  287
Reward:  -70.75598754342397
Mean Reward -75.11247926821176
Max reward so far:  91.80276966673995
Step 500
Step 1000
Step 1500
Step 2000
==========================================
Episode:  288
Reward:  -67.3421374702373
Mean Reward -75.08559227237102
Max reward so far:  91.80276966673995
Step 500
Step 1000
Step 1500
Step 2000
==========================================
Episode:  289
Reward:  -69.65871150279034
Mean Reward -75.06687889040694
Max reward so far:  91.80276966673995
Step 500
Step 1000
Step 1500
Step 2000
==========================================
Episode:  290
Reward:  -64.67077993122967
Mean Reward -75.03115346443039
Max reward so far:  91.80276966673995
Step 500
Step 1000
Step 1500
==========================================
Episode:  291
Reward:  -63.679650406818105
Mean Reward -74.99227845395912
Max reward so far:  91.80276966673995
Step 500
Step 1000
Step 1500
Step 2000
==========================================
Episode:  292
Reward:  -64.14382202984376
Mean Reward -74.95525300541266
Max reward so far:  91.80276966673995
Step 500
Step 1000
Step 1500
Step 2000
==========================================
Episode:  293
Reward:  -60.80807839565034
Mean Reward -74.90713336388283
Max reward so far:  91.80276966673995
Step 500
Step 1000
Step 1500
Step 2000
==========================================
Episode:  294
Reward:  -61.12161640041967
Mean Reward -74.860402797905
Max reward so far:  91.80276966673995
Step 500
Step 1000
Step 1500
Step 2000
==========================================
Episode:  295
Reward:  -63.08655010581289
Mean Reward -74.82062626853981
Max reward so far:  91.80276966673995
Step 500
Step 1000
Step 1500
Step 2000
==========================================
Episode:  296
Reward:  -62.791044678000766
Mean Reward -74.78012262682083
Max reward so far:  91.80276966673995
Step 500
Step 1000
Step 1500
Step 2000
==========================================
Episode:  297
Reward:  -65.13226168864459
Mean Reward -74.74774725454508
Max reward so far:  91.80276966673995
Step 500
Step 1000
Step 1500
Step 2000
==========================================
Episode:  298
Reward:  -63.03483099098013
Mean Reward -74.70857362155657
Max reward so far:  91.80276966673995
Step 500
Step 1000
Step 1500
==========================================
Episode:  299
Reward:  -64.78260173136397
Mean Reward -74.67548704858925
Max reward so far:  91.80276966673995
