Threads,Eigen-i5,Ad-hoc-i5,CUDA,Eigen-KNL,Ad-hoc-KNL
1,1.00,1.00,1.00,1.00,1.00
2,1.61,1.18,,1.74,1.28
4,2.14,1.11,,2.99,2.55
8,,,,4.71,4.86
16,,,,6.65,8.81
32,,,,8.26,13.63
68,,,,9.09,16.13
136,,,,9.00,14.41
272,,,,8.11,8.38
