Size of array;Repetitions;Step;Time (seconds)
1000000;1000;1;53.766602
1000000;1000;2;54.111813
1000000;1000;4;54.599327
1000000;1000;8;56.089340
1000000;1000;16;60.098091
1000000;1000;32;80.030479
1000000;1000;64;108.074493
1000000;1000;128;127.571892
1000000;1000;256;167.861832
1000000;1000;512;172.029953
1000000;1000;1024;171.544250
1000000;1000;2048;171.408310
