Size of matrix; Number of threads; Time (seconds)
4000;1;199.566177
4000;2;101.855904
4000;4;51.608101
4000;8;26.021765
4000;16;13.08446
4000;32;7.662725
4000;68;4.382292
4000;136;3.725363
4000;204;3.243842
4000;272;3.025687
8000;68;32.020348
8000;136;27.128319
8000;204;24.251892
8000;272;23.338959
16000;68;269.094818
16000;136;205.235138
16000;204;232.54216
16000;272;232.126709
32000;68;2586.852783
32000;272;3681.958984
