Configuracion;$ijk$--caché;$ijk$--\textit{flat};$ijk$--\textit{hybrid};$ikj$--caché;$ikj$--\textit{flat};$ikj$--\textit{hybrid};$jki$--caché;$jki$--\textit{flat};$jki$--\textit{hybrid}
1;1.00;1.00;1.00;1.00;1.00;1.00;1.00;1.00;1.00
2;1.82;1.85;1.92;1.93;1.94;1.96;1.88;1.90;1.91
4;3.59;3.72;3.58;3.88;3.87;3.89;3.78;3.71;3.77
8;7.10;6.21;6.21;7.76;7.69;7.78;7.54;5.87;5.82
16;14.90;11.82;14.63;15.57;14.85;15.35;12.45;10.30;10.26
32;24.07;19.35;24.30;30.37;25.02;29.69;21.30;17.73;17.50
68;34.36;36.05;38.62;46.35;49.05;44.02;33.92;31.45;31.38
136;49.46;43.13;42.97;54.99;53.19;58.98;33.37;33.71;31.02
204;45.23;45.08;43.58;64.13;60.76;61.83;33.96;32.12;32.12
272;49.58;50.26;49.17;67.11;68.28;66.90;35.28;34.70;33.63
