Size of matrix; Number of threads; Time (seconds)
4000;1;194.618637
4000;2;98.773834
4000;4;49.807468
4000;8;25.220234
4000;16;12.985456
4000;32;7.300939
4000;68;4.723877
4000;136;5.024563
4000;204;5.896319
4000;272;7.209997
8000;68;42.467075
8000;136;64.414001
8000;204;86.435417
8000;272;98.625206
16000;68;679.706299
16000;136;374.361725
16000;204;576.474365
16000;272;997.372192
32000;68;3294.590332
32000;272;7181.970703
