Size of matrix; Number of threads; Time (seconds)
4000;1;195.124466
4000;2;99.063812
4000;4;49.852642
4000;8;25.309536
4000;16;13.330797
4000;32;8.173178
4000;68;5.712145
4000;136;3.817482
4000;204;6.193223
4000;272;8.377459
8000;68;43.155014
8000;136;71.817673
8000;204;78.830055
8000;272;112.131508
16000;68;797.448242
16000;136;926.969116
16000;204;570.081726
16000;272;1048.903564
32000;68;3763.038818
32000;272;11212.291016
