Size of matrix; Number of threads; Time (seconds)
4000;1;1071.19458
4000;2;588.064941
4000;4;298.782806
4000;8;150.90062
4000;16;71.877151
4000;32;44.509266
4000;68;31.177498
4000;136;21.659981
4000;204;23.681931
4000;272;21.605009
8000;68;242.2659
8000;136;215.135254
8000;204;233.903778
8000;272;160.62262
16000;68;1681.327393
16000;136;1430.633667
16000;204;1409.227661
16000;272;1386.68811
32000;68;13625.34668
32000;136;12620.296875
32000;204;12811.351562
32000;272;12881.057617
