Size of matrix; Number of threads; Time (seconds)
4000;1;1461.011475
4000;2;766.109558
4000;4;387.802704
4000;8;251.032654
4000;16;142.397491
4000;32;83.492554
4000;68;46.553055
4000;136;47.100254
4000;204;45.481972
4000;272;43.441582
8000;68;393.629700
8000;136;342.962677
8000;204;348.965973
8000;272;350.027344
16000;68;3058.559570
16000;136;2907.919189
16000;204;2854.034668
16000;272;2979.214111
32000;68;26478.763672
32000;272;25437.210938
