::::::::::::::
coherency_line_size
::::::::::::::
64

::::::::::::::
level
::::::::::::::
1

::::::::::::::
number_of_sets
::::::::::::::
64

::::::::::::::
physical_line_partition
::::::::::::::
1

::::::::::::::
shared_cpu_list
::::::::::::::
0,68,136,204

::::::::::::::
shared_cpu_map
::::::::::::::
0000,00000000,00001000,00000000,00000100,00000000,00000010,00000000,00000001

::::::::::::::
size
::::::::::::::
32K

::::::::::::::
type
::::::::::::::
Instruction

::::::::::::::
ways_of_associativity
::::::::::::::
8
