Size of matrix; Number of threads; Time (seconds)
4000;1;1019.36676
4000;2;540.047424
4000;4;271.487244
4000;8;131.444565
4000;16;71.206078
4000;32;43.80735
4000;68;29.436277
4000;136;22.436642
4000;204;22.310955
4000;272;28.140797
8000;68;435.409271
8000;136;398.187683
8000;204;349.390839
8000;272;403.692352
16000;68;4213.330078
16000;136;4064.128906
16000;204;3398.64209
16000;272;3996.811035
32000;68;45388.03125
32000;272;25454.169922
