Size of matrix; Number of threads; Time (seconds)
4000;1;201.725754
4000;2;104.28344
4000;4;52.054829
4000;8;26.009539
4000;16;12.960061
4000;32;6.64166
4000;68;4.351977
4000;136;3.668606
4000;204;3.145585
4000;272;3.006071
8000;68;32.70211
8000;136;27.238979
8000;204;23.906269
8000;272;24.702862
16000;68;250.090759
16000;136;203.423569
16000;204;243.201996
16000;272;243.297577
32000;68;1951.719971
32000;136;2056.096924
32000;204;1990.521851
32000;272;2131.300293
