Number of iterations,Number of threads,Time (seconds),Speedup,Efficiency
100000000,1,44.148397,1,1.00
100000000,2,22.349869,1.98,0.99
100000000,4,11.231665,3.93,0.98
100000000,8,5.652549,7.81,0.98
100000000,16,2.855048,15.46,0.97
100000000,32,1.43203,30.83,0.96
100000000,68,0.853806,51.71,0.76
100000000,136,0.522634,84.47,0.62
100000000,204,0.405364,108.91,0.53
100000000,272,0.390114,113.17,0.42
