Number of iterations,Number of threads,Time (seconds)
1000000,1,0.466576
1000000,2,0.237325
1000000,4,0.124985
1000000,8,0.058265
1000000,16,0.030938
1000000,32,0.017502
1000000,68,0.014325
1000000,136,0.023346
1000000,204,0.035402
1000000,272,0.045199
10000000,1,4.473909
10000000,2,2.27833
10000000,4,1.146399
10000000,8,0.575789
10000000,16,0.290002
10000000,32,0.147992
10000000,68,0.075045
10000000,136,0.068186
10000000,204,0.064794
10000000,272,0.076686
100000000,1,44.148397
100000000,2,22.349869
100000000,4,11.231665
100000000,8,5.652549
100000000,16,2.855048
100000000,32,1.43203
100000000,68,0.853806
100000000,136,0.522634
100000000,204,0.405364
100000000,272,0.390114
1000000000,68,7.86541
1000000000,136,4.778009
1000000000,204,3.468592
1000000000,272,2.861509
10000000000,68,71.840693
10000000000,136,45.824336
10000000000,204,33.088249
10000000000,272,26.995282
