::::::::::::::
coherency_line_size
::::::::::::::
64

::::::::::::::
level
::::::::::::::
2

::::::::::::::
number_of_sets
::::::::::::::
1024

::::::::::::::
physical_line_partition
::::::::::::::
1

::::::::::::::
shared_cpu_list
::::::::::::::
0-1,68-69,136-137,204-205

::::::::::::::
shared_cpu_map
::::::::::::::
0000,00000000,00003000,00000000,00000300,00000000,00000030,00000000,00000003

::::::::::::::
size
::::::::::::::
1024K

::::::::::::::
type
::::::::::::::
Unified

::::::::::::::
ways_of_associativity
::::::::::::::
16
