Size of matrix; Number of threads; Time (seconds)
4000;1;1451.952026
4000;2;744.77356
4000;4;383.200958
4000;8;198.240356
4000;16;138.498154
4000;32;75.640686
4000;68;41.532677
4000;136;39.806622
4000;204;43.447132
4000;272;40.724731
8000;68;397.408203
8000;136;325.712006
8000;204;331.183807
8000;272;319.407654
16000;68;3068.342529
16000;136;2712.183105
16000;204;2673.847168
16000;272;2636.020264
32000;68;25660.214844
32000;272;21650.126953
