Size of matrix; Number of threads; Time (seconds)
4000;1;197.581085
4000;2;100.989792
4000;4;50.783028
4000;8;25.405701
4000;16;12.870827
4000;32;6.653765
4000;68;4.488658
4000;136;3.350224
4000;204;3.195556
4000;272;2.953427
8000;68;34.398811
8000;136;23.748997
8000;204;23.791182
8000;272;24.700846
16000;68;213.638412
16000;136;211.781738
16000;204;240.301025
16000;272;241.190125
32000;68;2058.776123
32000;272;2154.069580
