Size of matrix; Number of threads; Time (seconds)
4000;1;1041.440796
4000;2;549.850464
4000;4;297.118744
4000;8;162.669724
4000;16;86.272545
4000;32;42.671165
4000;68;27.683849
4000;136;21.245016
4000;204;23.232262
4000;272;20.685781
8000;68;235.218857
8000;136;218.726364
8000;204;199.302246
8000;272;163.572296
16000;68;1667.909302
16000;136;1401.343994
16000;204;1587.519287
16000;272;1479.289307
32000;68;13122.719727
32000;272;10936.53418
