Size of matrix; Number of threads; Time (seconds)
   250 ;   1 ;   0.043799
   250 ;   2 ;   0.032997
   250 ;   4 ;   0.017608
   250 ;   8 ;   0.009540
   250 ;  16 ;   0.007793
   250 ;  32 ;   0.007399
   250 ;  68 ;   0.009041
   250 ; 136 ;   0.017710
   250 ; 204 ;   0.026093
   250 ; 272 ;   0.040408
   500 ;   1 ;   0.431787
   500 ;   2 ;   0.250450
   500 ;   4 ;   0.119406
   500 ;   8 ;   0.063068
   500 ;  16 ;   0.033600
   500 ;  32 ;   0.019173
   500 ;  68 ;   0.023986
   500 ; 136 ;   0.030293
   500 ; 204 ;   0.037950
   500 ; 272 ;   0.047960
  1000 ;   1 ;   3.315589
  1000 ;   2 ;   1.785377
  1000 ;   4 ;   0.855296
  1000 ;   8 ;   0.517672
  1000 ;  16 ;   0.257114
  1000 ;  32 ;   0.132738
  1000 ;  68 ;   0.074978
  1000 ; 136 ;   0.106669
  1000 ; 204 ;   0.101470
  1000 ; 272 ;   0.105304
  2000 ;   1 ;  24.976065
  2000 ;   2 ;  13.154047
  2000 ;   4 ;   6.591203
  2000 ;   8 ;   3.311059
  2000 ;  16 ;   1.674541
  2000 ;  32 ;   1.045364
  2000 ;  68 ;   0.532585
  2000 ; 136 ;   0.563594
  2000 ; 204 ;   0.515308
  2000 ; 272 ;   0.492187
  4000 ;   1 ; 198.686981
  4000 ;   2 ; 103.813248
  4000 ;   4 ;  52.133877
  4000 ;   8 ;  26.457483
  4000 ;  16 ;  12.990318
  4000 ;  32 ;   6.605005
  4000 ;  68 ;   5.378570
  4000 ; 136 ;   4.105655
  4000 ; 204 ;   3.346038
  4000 ; 272 ;   3.119839
  8000 ;  68 ;  34.553795
  8000 ; 136 ;  30.064980
  8000 ; 204 ;  26.748795
  8000 ; 272 ;  25.916397
 16000 ;  68 ; 293.570557
 16000 ; 136 ; 227.570099
 16000 ; 204 ; 240.690979
 16000 ; 272 ; 231.649887
 32000 ;  68 ; 2328.173096
 32000 ; 136 ; 2016.626831
 32000 ; 204 ; 1958.148560
 32000 ; 272 ; 1875.832031
