Size of matrix; Number of threads; Time (seconds)
4000;1;1779.667725
4000;2;779.401062
4000;4;406.829254
4000;8;242.406708
4000;16;140.71814
4000;32;72.638794
4000;68;89.239334
4000;136;45.752419
4000;204;49.339725
4000;272;55.11171
8000;68;1281.665527
8000;136;645.626892
8000;204;498.792908
8000;272;436.009277
16000;68;5244.186523
16000;136;3181.356689
16000;204;3474.518799
16000;272;3797.560303
32000;68;37930.34375
32000;272;44729.164062
