Iteration;Fitness
0;380.777961
1;380.777961
2;379.885357
3;377.461373
4;371.740500
5;369.673583
6;364.378041
7;364.378041
8;357.874448
9;357.175412
10;351.598830
11;351.598830
12;350.686191
13;347.878102
14;347.271652
15;339.702103
16;335.158612
17;334.559599
18;329.453369
19;326.609114
20;326.609114
21;324.140051
22;324.140051
23;324.140051
24;322.997201
25;322.997201
26;317.236785
27;317.236785
28;317.236785
29;312.403949
30;312.403949
31;312.403949
32;312.403949
33;312.403949
34;311.340880
35;311.340880
36;309.614181
37;309.614181
38;307.591285
39;307.591285
40;307.591285
41;307.107125
42;307.107125
43;305.152409
44;304.951239
45;304.951239
46;301.091327
47;300.376697
48;300.376697
49;298.737104
50;298.737104
51;298.737104
52;298.737104
53;298.737104
54;298.737104
55;297.748588
56;297.748588
57;295.510419
58;295.510419
59;295.510419
60;295.510419
61;295.510419
62;295.510419
63;295.510419
64;295.510419
65;295.510419
66;295.510419
67;295.510419
68;295.408650
69;295.408650
70;295.040468
71;295.040468
72;295.040468
73;295.040468
74;295.040468
75;295.040468
76;295.040468
77;295.040468
78;294.689727
79;294.077545
80;294.077545
81;294.077545
82;294.077545
83;294.077545
84;294.077545
85;294.077545
86;294.077545
87;294.077545
88;294.077545
89;293.499582
90;293.499582
91;293.499582
92;293.499582
93;293.499582
94;293.499582
95;293.499582
96;293.499582
97;293.499582
98;293.499582
99;293.499582
100;293.499582
101;293.499582
102;293.499582
103;293.499582
104;293.499582
105;293.499582
106;293.499582
107;293.499582
108;293.499582
109;293.499582
110;293.499582
111;293.499582
112;293.499582
113;293.499582
114;293.499582
115;293.402005
116;293.402005
117;293.402005
118;293.402005
119;293.402005
120;293.402005
121;293.402005
122;293.402005
123;293.402005
124;293.402005
125;293.402005
126;293.402005
127;293.402005
128;293.402005
129;293.402005
130;293.402005
131;293.402005
132;293.402005
133;293.402005
134;293.402005
135;293.402005
136;293.402005
137;293.402005
138;293.402005
139;293.402005
140;293.402005
141;293.402005
142;293.402005
143;293.402005
144;293.402005
145;293.402005
146;293.402005
147;293.402005
148;293.402005
149;293.402005
150;293.402005
151;293.402005
152;293.402005
153;293.402005
154;293.402005
155;293.402005
156;293.402005
157;293.402005
158;293.402005
159;293.402005
160;293.402005
161;293.402005
162;293.402005
163;293.402005
164;293.402005
165;293.402005
166;293.402005
167;293.402005
168;293.402005
169;293.402005
170;293.402005
171;293.402005
172;293.402005
173;293.402005
174;293.402005
175;293.402005
176;293.402005
177;293.402005
178;293.402005
179;293.402005
180;293.402005
181;293.402005
182;293.402005
183;293.402005
184;293.402005
185;293.402005
186;293.402005
187;293.402005
188;293.402005
189;293.402005
190;293.402005
191;293.402005
192;293.332217
193;293.332217
194;293.332217
195;293.332217
196;293.332217
197;293.332217
198;293.332217
199;293.332217
200;293.332217
201;293.332217
202;293.332217
203;293.332217
204;293.332217
205;293.332217
206;293.332217
207;293.332217
208;293.332217
209;293.332217
210;293.332217
211;293.332217
212;293.332217
213;293.332217
214;293.332217
215;293.332217
216;293.332217
217;293.332217
218;293.332217
219;293.332217
220;293.332217
221;293.332217
222;293.332217
223;293.332217
224;293.332217
225;293.332217
226;293.332217
227;293.332217
228;293.332217
229;293.332217
230;293.332217
231;293.332217
232;293.332217
233;293.332217
234;293.332217
235;293.332217
236;293.332217
237;293.332217
238;293.332217
239;293.332217
240;293.332217
241;293.332217
242;293.332217
243;293.332217
244;293.332217
245;293.332217
246;293.332217
247;293.332217
248;293.332217
249;293.332217
250;293.332217
251;293.332217
252;293.332217
253;293.332217
254;293.332217
255;293.332217
256;293.332217
257;293.332217
258;293.332217
259;293.332217
260;293.332217
261;293.332217
262;293.332217
263;293.332217
264;293.332217
265;293.332217
266;293.332217
267;293.332217
268;293.332217
269;293.332217
270;293.332217
271;293.332217
272;293.332217
273;293.332217
274;293.332217
275;293.332217
276;293.332217
277;293.332217
278;293.332217
279;293.332217
280;293.332217
281;293.332217
282;293.332217
283;293.332217
284;293.332217
285;293.332217
286;293.332217
287;293.332217
288;293.332217
289;293.332217
290;293.332217
291;293.332217
292;293.332217
293;293.332217
294;293.332217
295;293.332217
296;293.332217
297;293.332217
298;293.332217
299;293.332217
300;293.332217
301;293.332217
302;293.332217
303;293.332217
304;293.332217
305;293.332217
306;293.332217
307;293.332217
308;293.332217
309;293.332217
310;293.332217
311;293.332217
312;293.332217
313;293.332217
314;293.332217
315;293.332217
316;293.332217
317;293.332217
318;293.332217
319;293.332217
320;293.332217
321;293.332217
322;293.332217
323;293.332217
324;293.332217
325;293.332217
326;293.332217
327;293.332217
328;293.332217
329;293.332217
330;293.332217
331;293.332217
332;293.332217
333;293.332217
334;293.332217
335;293.332217
336;293.332217
337;293.332217
338;293.332217
339;293.332217
340;293.332217
341;293.332217
342;293.332217
343;293.332217
344;293.332217
345;293.332217
346;293.332217
347;293.332217
348;293.332217
349;293.332217
350;293.332217
351;293.332217
352;293.332217
353;293.301984
354;293.301984
355;293.301984
356;293.301984
357;293.301984
358;293.301984
359;293.301984
360;293.301984
361;293.301984
362;293.301984
363;293.301984
364;293.301984
365;293.301984
366;293.301984
367;293.301984
368;293.301984
369;293.301984
370;293.301984
371;293.301984
372;293.301984
373;293.301984
374;293.301984
375;293.301984
376;293.301984
377;293.301984
378;293.301984
379;293.301984
380;293.301984
381;293.301984
382;293.301984
383;293.301984
384;293.301984
385;293.301984
386;293.301984
387;293.301984
388;293.301984
389;293.301984
390;293.301984
391;293.301984
392;293.301984
393;293.301984
394;293.301984
395;293.301984
396;293.301984
397;293.301984
398;293.301984
399;293.301984
400;293.301984
401;293.301984
402;293.301984
403;293.301984
404;293.301984
405;293.301984
406;293.301984
407;293.301984
408;293.301984
409;293.301984
410;293.301984
411;293.301984
412;293.301984
413;293.301984
414;293.301984
415;293.301984
416;293.301984
417;293.301984
418;293.301984
419;293.301984
420;293.301984
421;293.301984
422;293.301984
423;293.301984
424;293.301984
425;293.301984
426;293.301984
427;293.301984
428;293.301984
429;293.301984
430;293.301984
431;293.301984
432;293.301984
433;293.301984
434;293.301984
435;293.301984
436;293.301984
437;293.301984
438;293.301984
439;293.301984
440;293.301984
441;293.301984
442;293.301984
443;293.301984
444;293.301984
445;293.301984
446;293.301984
447;293.301984
448;293.301984
449;293.301984
450;293.301984
451;293.301984
452;293.301984
453;293.301984
454;293.301984
455;293.301984
456;293.301984
457;293.301984
458;293.301984
459;293.301984
460;293.301984
461;293.301984
462;293.301984
463;293.301984
464;293.301984
465;293.301984
466;293.301984
467;293.301984
468;293.301984
469;293.301984
470;293.301984
471;293.301984
472;293.301984
473;293.301984
474;293.301984
475;293.301984
476;293.301984
477;293.301984
478;293.301984
479;293.301984
480;293.301984
481;293.301984
482;293.301984
483;293.301984
484;293.301984
485;293.301984
486;293.301984
487;293.301984
488;293.301984
489;293.301984
490;293.301984
491;293.301984
492;293.301984
493;293.301984
494;293.301984
495;293.301984
496;293.301984
497;293.301984
498;293.301984
499;293.301984
