2020-02-08T15:10:16.3729745+04:00  [INF] Application started. Press Ctrl+C to shut down. (dcaefe54)
2020-02-08T15:10:16.3792563+04:00  [INF] Hosting environment: "Development" (c3307c92)
2020-02-08T15:10:16.3806286+04:00  [INF] Content root path: "D:\Projects\AMB.Bonus\ABM.Bonus.API\ABM.Bonus.API" (b5d60022)
2020-02-08T15:10:16.4434014+04:00 800000bb-0004-f700-b63f-84710c7967bb [WRN] Failed to determine the https port for redirect. (ca76cc21)
2020-02-08T15:10:38.3233299+04:00 800000bc-0004-f700-b63f-84710c7967bb [INF] Start processing HTTP request "GET" http://localhost:52650/api/Card/GetByUserId (338f1c77)
2020-02-08T15:10:38.3258154+04:00 800000bc-0004-f700-b63f-84710c7967bb [INF] Sending HTTP request "GET" http://localhost:52650/api/Card/GetByUserId (2e7ac211)
2020-02-08T15:10:38.4930698+04:00 800000bc-0004-f700-b63f-84710c7967bb [INF] Received HTTP response after 162.2367ms - NotFound (6350df9e)
2020-02-08T15:10:38.4953873+04:00 800000bc-0004-f700-b63f-84710c7967bb [INF] End processing HTTP request after 178.9768ms - NotFound (7656b38e)
2020-02-08T15:16:15.0616261+04:00  [INF] Application started. Press Ctrl+C to shut down. (dcaefe54)
2020-02-08T15:16:15.0670346+04:00  [INF] Hosting environment: "Development" (c3307c92)
2020-02-08T15:16:15.0687691+04:00  [INF] Content root path: "D:\Projects\AMB.Bonus\ABM.Bonus.API\ABM.Bonus.API" (b5d60022)
2020-02-08T15:16:15.1082132+04:00 800000e3-0003-fd00-b63f-84710c7967bb [WRN] Failed to determine the https port for redirect. (ca76cc21)
2020-02-08T15:16:21.1604582+04:00 800000e6-0003-fd00-b63f-84710c7967bb [WRN] No type was specified for the decimal column '"Bonus"' on entity type '"Card"'. This will cause values to be silently truncated if they do not fit in the default precision and scale. Explicitly specify the SQL server column type that can accommodate all the values using 'HasColumnType()'. (3a0db05f)
2020-02-08T15:16:21.1625149+04:00 800000e6-0003-fd00-b63f-84710c7967bb [WRN] No type was specified for the decimal column '"Bonus"' on entity type '"TransactionFact"'. This will cause values to be silently truncated if they do not fit in the default precision and scale. Explicitly specify the SQL server column type that can accommodate all the values using 'HasColumnType()'. (3a0db05f)
2020-02-08T15:17:22.8443352+04:00  [INF] Application started. Press Ctrl+C to shut down. (dcaefe54)
2020-02-08T15:17:22.8505852+04:00  [INF] Hosting environment: "Development" (c3307c92)
2020-02-08T15:17:22.8520364+04:00  [INF] Content root path: "D:\Projects\AMB.Bonus\ABM.Bonus.API\ABM.Bonus.API" (b5d60022)
2020-02-08T15:17:22.8917353+04:00 800000e8-0003-fd00-b63f-84710c7967bb [WRN] Failed to determine the https port for redirect. (ca76cc21)
2020-02-08T15:17:28.3998809+04:00 800000e9-0003-fd00-b63f-84710c7967bb [WRN] No type was specified for the decimal column '"Bonus"' on entity type '"Card"'. This will cause values to be silently truncated if they do not fit in the default precision and scale. Explicitly specify the SQL server column type that can accommodate all the values using 'HasColumnType()'. (3a0db05f)
2020-02-08T15:17:28.4020868+04:00 800000e9-0003-fd00-b63f-84710c7967bb [WRN] No type was specified for the decimal column '"Bonus"' on entity type '"TransactionFact"'. This will cause values to be silently truncated if they do not fit in the default precision and scale. Explicitly specify the SQL server column type that can accommodate all the values using 'HasColumnType()'. (3a0db05f)
2020-02-08T15:24:02.8205629+04:00  [INF] Application started. Press Ctrl+C to shut down. (dcaefe54)
2020-02-08T15:24:02.8275250+04:00  [INF] Hosting environment: "Development" (c3307c92)
2020-02-08T15:24:02.8297868+04:00  [INF] Content root path: "D:\Projects\AMB.Bonus\ABM.Bonus.API\ABM.Bonus.API" (b5d60022)
2020-02-08T15:24:02.8837266+04:00 800000e9-0005-fe00-b63f-84710c7967bb [WRN] Failed to determine the https port for redirect. (ca76cc21)
2020-02-08T15:24:06.7186718+04:00 800000ea-0005-fe00-b63f-84710c7967bb [WRN] No type was specified for the decimal column '"Bonus"' on entity type '"Card"'. This will cause values to be silently truncated if they do not fit in the default precision and scale. Explicitly specify the SQL server column type that can accommodate all the values using 'HasColumnType()'. (3a0db05f)
2020-02-08T15:24:06.7205407+04:00 800000ea-0005-fe00-b63f-84710c7967bb [WRN] No type was specified for the decimal column '"Bonus"' on entity type '"TransactionFact"'. This will cause values to be silently truncated if they do not fit in the default precision and scale. Explicitly specify the SQL server column type that can accommodate all the values using 'HasColumnType()'. (3a0db05f)
