%YAML 1.1
%TAG !u! tag:unity3d.com,2011:
--- !u!114 &11400000
MonoBehaviour:
  m_ObjectHideFlags: 0
  m_CorrespondingSourceObject: {fileID: 0}
  m_PrefabInstance: {fileID: 0}
  m_PrefabAsset: {fileID: 0}
  m_GameObject: {fileID: 0}
  m_Enabled: 1
  m_EditorHideFlags: 0
  m_Script: {fileID: 11500000, guid: 86cc0f8cf0b12732aaa251bb94d75686, type: 3}
  m_Name: HamerSoftMain
  m_EditorClassIdentifier: 
  plugins:
  - {fileID: 11400000, guid: 249dc95e0be8633849b7239494025119, type: 2}
