%YAML 1.1
%TAG !u! tag:unity3d.com,2011:
--- !u!1001 &6915077609443760460
PrefabInstance:
  m_ObjectHideFlags: 0
  serializedVersion: 2
  m_Modification:
    m_TransformParent: {fileID: 0}
    m_Modifications:
    - target: {fileID: 8822612684423171214, guid: 89b9f52dec3f0eb788f932b26f037dde,
        type: 3}
      propertyPath: m_Color.r
      value: 0
      objectReference: {fileID: 0}
    - target: {fileID: 8822612684423171214, guid: 89b9f52dec3f0eb788f932b26f037dde,
        type: 3}
      propertyPath: m_Color.g
      value: 1
      objectReference: {fileID: 0}
    - target: {fileID: 8822612684423171214, guid: 89b9f52dec3f0eb788f932b26f037dde,
        type: 3}
      propertyPath: m_Color.b
      value: 0.17926908
      objectReference: {fileID: 0}
    - target: {fileID: 8822612684712084020, guid: 89b9f52dec3f0eb788f932b26f037dde,
        type: 3}
      propertyPath: m_Name
      value: Pair3
      objectReference: {fileID: 0}
    - target: {fileID: 8822612684712084023, guid: 89b9f52dec3f0eb788f932b26f037dde,
        type: 3}
      propertyPath: m_LocalPosition.x
      value: 0
      objectReference: {fileID: 0}
    - target: {fileID: 8822612684712084023, guid: 89b9f52dec3f0eb788f932b26f037dde,
        type: 3}
      propertyPath: m_LocalPosition.y
      value: 0
      objectReference: {fileID: 0}
    - target: {fileID: 8822612684712084023, guid: 89b9f52dec3f0eb788f932b26f037dde,
        type: 3}
      propertyPath: m_LocalPosition.z
      value: 0
      objectReference: {fileID: 0}
    - target: {fileID: 8822612684712084023, guid: 89b9f52dec3f0eb788f932b26f037dde,
        type: 3}
      propertyPath: m_LocalRotation.x
      value: 0
      objectReference: {fileID: 0}
    - target: {fileID: 8822612684712084023, guid: 89b9f52dec3f0eb788f932b26f037dde,
        type: 3}
      propertyPath: m_LocalRotation.y
      value: 0
      objectReference: {fileID: 0}
    - target: {fileID: 8822612684712084023, guid: 89b9f52dec3f0eb788f932b26f037dde,
        type: 3}
      propertyPath: m_LocalRotation.z
      value: 0
      objectReference: {fileID: 0}
    - target: {fileID: 8822612684712084023, guid: 89b9f52dec3f0eb788f932b26f037dde,
        type: 3}
      propertyPath: m_LocalRotation.w
      value: 1
      objectReference: {fileID: 0}
    - target: {fileID: 8822612684712084023, guid: 89b9f52dec3f0eb788f932b26f037dde,
        type: 3}
      propertyPath: m_RootOrder
      value: 0
      objectReference: {fileID: 0}
    - target: {fileID: 8822612684712084023, guid: 89b9f52dec3f0eb788f932b26f037dde,
        type: 3}
      propertyPath: m_LocalEulerAnglesHint.x
      value: 0
      objectReference: {fileID: 0}
    - target: {fileID: 8822612684712084023, guid: 89b9f52dec3f0eb788f932b26f037dde,
        type: 3}
      propertyPath: m_LocalEulerAnglesHint.y
      value: 0
      objectReference: {fileID: 0}
    - target: {fileID: 8822612684712084023, guid: 89b9f52dec3f0eb788f932b26f037dde,
        type: 3}
      propertyPath: m_LocalEulerAnglesHint.z
      value: 0
      objectReference: {fileID: 0}
    - target: {fileID: 8822612684712084023, guid: 89b9f52dec3f0eb788f932b26f037dde,
        type: 3}
      propertyPath: m_AnchoredPosition.x
      value: 0
      objectReference: {fileID: 0}
    - target: {fileID: 8822612684712084023, guid: 89b9f52dec3f0eb788f932b26f037dde,
        type: 3}
      propertyPath: m_AnchoredPosition.y
      value: 0
      objectReference: {fileID: 0}
    - target: {fileID: 8822612684712084023, guid: 89b9f52dec3f0eb788f932b26f037dde,
        type: 3}
      propertyPath: m_SizeDelta.x
      value: 0
      objectReference: {fileID: 0}
    - target: {fileID: 8822612684712084023, guid: 89b9f52dec3f0eb788f932b26f037dde,
        type: 3}
      propertyPath: m_SizeDelta.y
      value: 0
      objectReference: {fileID: 0}
    - target: {fileID: 8822612684712084023, guid: 89b9f52dec3f0eb788f932b26f037dde,
        type: 3}
      propertyPath: m_AnchorMin.x
      value: 0.33
      objectReference: {fileID: 0}
    - target: {fileID: 8822612684712084023, guid: 89b9f52dec3f0eb788f932b26f037dde,
        type: 3}
      propertyPath: m_AnchorMin.y
      value: 0
      objectReference: {fileID: 0}
    - target: {fileID: 8822612684712084023, guid: 89b9f52dec3f0eb788f932b26f037dde,
        type: 3}
      propertyPath: m_AnchorMax.x
      value: 0.66
      objectReference: {fileID: 0}
    - target: {fileID: 8822612684712084023, guid: 89b9f52dec3f0eb788f932b26f037dde,
        type: 3}
      propertyPath: m_AnchorMax.y
      value: 0.25
      objectReference: {fileID: 0}
    - target: {fileID: 8822612684712084023, guid: 89b9f52dec3f0eb788f932b26f037dde,
        type: 3}
      propertyPath: m_Pivot.x
      value: 0.5
      objectReference: {fileID: 0}
    - target: {fileID: 8822612684712084023, guid: 89b9f52dec3f0eb788f932b26f037dde,
        type: 3}
      propertyPath: m_Pivot.y
      value: 0
      objectReference: {fileID: 0}
    - target: {fileID: 8822612685737434849, guid: 89b9f52dec3f0eb788f932b26f037dde,
        type: 3}
      propertyPath: m_Color.r
      value: 0
      objectReference: {fileID: 0}
    - target: {fileID: 8822612685737434849, guid: 89b9f52dec3f0eb788f932b26f037dde,
        type: 3}
      propertyPath: m_Color.g
      value: 1
      objectReference: {fileID: 0}
    - target: {fileID: 8822612685737434849, guid: 89b9f52dec3f0eb788f932b26f037dde,
        type: 3}
      propertyPath: m_Color.b
      value: 0.17926908
      objectReference: {fileID: 0}
    m_RemovedComponents: []
  m_SourcePrefab: {fileID: 100100000, guid: 89b9f52dec3f0eb788f932b26f037dde, type: 3}
