%YAML 1.1
%TAG !u! tag:unity3d.com,2011:
--- !u!114 &11400000
MonoBehaviour:
  m_ObjectHideFlags: 0
  m_CorrespondingSourceObject: {fileID: 0}
  m_PrefabInstance: {fileID: 0}
  m_PrefabAsset: {fileID: 0}
  m_GameObject: {fileID: 0}
  m_Enabled: 1
  m_EditorHideFlags: 0
  m_Script: {fileID: 11500000, guid: 00ac411702ff3624b9797f05a0124093, type: 3}
  m_Name: BR3
  m_EditorClassIdentifier: 
  name: BR3
  icon: {fileID: 0}
  increase: 4
  active: 0
  turretTipe: 1
  Tecnology: 3
  parent:
  - {fileID: 11400000, guid: af2d0f79ef748d44f8424cff64a55659, type: 2}
  childsTecnologies:
  - {fileID: 11400000, guid: 8961ef619c5998144837e1ea0e13dc80, type: 2}
