%YAML 1.1
%TAG !u! tag:unity3d.com,2011:
--- !u!114 &11400000
MonoBehaviour:
  m_ObjectHideFlags: 0
  m_CorrespondingSourceObject: {fileID: 0}
  m_PrefabInstance: {fileID: 0}
  m_PrefabAsset: {fileID: 0}
  m_GameObject: {fileID: 0}
  m_Enabled: 1
  m_EditorHideFlags: 0
  m_Script: {fileID: 11500000, guid: 00ac411702ff3624b9797f05a0124093, type: 3}
  m_Name: specialARA
  m_EditorClassIdentifier: 
  name: specialARA
  icon: {fileID: 0}
  increase: 1
  Tecnology: 7
  parent:
  - {fileID: 11400000, guid: 7dbbc31fc6c2bdc438dc04b9c740982c, type: 2}
  - {fileID: 11400000, guid: 03a9201e932ade643a41fd57d562e431, type: 2}
  - {fileID: 11400000, guid: 8e7d926e1f66b2b488d743b9ee10fe1b, type: 2}
  - {fileID: 11400000, guid: fbf68a36555523b4dbe726d0d3bb226a, type: 2}
  childsTecnologies: []
