%YAML 1.1
%TAG !u! tag:unity3d.com,2011:
--- !u!114 &11400000
MonoBehaviour:
  m_ObjectHideFlags: 0
  m_CorrespondingSourceObject: {fileID: 0}
  m_PrefabInstance: {fileID: 0}
  m_PrefabAsset: {fileID: 0}
  m_GameObject: {fileID: 0}
  m_Enabled: 1
  m_EditorHideFlags: 0
  m_Script: {fileID: 11500000, guid: 5ff0e28013dd7404ea4d4178a0dec257, type: 3}
  m_Name: CD2
  m_EditorClassIdentifier: 
  name: CD2
  icon: {fileID: 0}
  increase: 0
  active: 0
  Tecnology: 0
  CTecnology: 0
  turretTipe: 3
  parent: []
  childsTecnologies: []
