%YAML 1.1
%TAG !u! tag:unity3d.com,2011:
--- !u!114 &11400000
MonoBehaviour:
  m_ObjectHideFlags: 0
  m_CorrespondingSourceObject: {fileID: 0}
  m_PrefabInstance: {fileID: 0}
  m_PrefabAsset: {fileID: 0}
  m_GameObject: {fileID: 0}
  m_Enabled: 1
  m_EditorHideFlags: 0
  m_Script: {fileID: 11500000, guid: 00ac411702ff3624b9797f05a0124093, type: 3}
  m_Name: AR2
  m_EditorClassIdentifier: 
  name: AR2
  icon: {fileID: 0}
  increase: 4
  Tecnology: 3
  parent:
  - {fileID: 11400000, guid: 52b20a22b70ae01468d857bb9bd6cfac, type: 2}
  childsTecnologies:
  - {fileID: 11400000, guid: 24759fd4f981dda46ab9c5dc93530c36, type: 2}
