%YAML 1.1
%TAG !u! tag:unity3d.com,2011:
--- !u!135 &1075210098
SphereCollider:
  m_ObjectHideFlags: 0
  m_CorrespondingSourceObject: {fileID: 0}
  m_PrefabInstance: {fileID: 0}
  m_PrefabAsset: {fileID: 0}
  m_GameObject: {fileID: 6791016303459602696}
  m_Material: {fileID: 0}
  m_IsTrigger: 1
  m_Enabled: 1
  serializedVersion: 2
  m_Radius: 0.09977301
  m_Center: {x: 0, y: -0.000000040978204, z: -0.000000022351747}
--- !u!1001 &6791016303459637160
PrefabInstance:
  m_ObjectHideFlags: 0
  serializedVersion: 2
  m_Modification:
    m_TransformParent: {fileID: 0}
    m_Modifications:
    - target: {fileID: 100000, guid: 0dafbae71666f874b859bc029977b27b, type: 3}
      propertyPath: m_Name
      value: Chatarra
      objectReference: {fileID: 0}
    - target: {fileID: 100000, guid: 0dafbae71666f874b859bc029977b27b, type: 3}
      propertyPath: m_TagString
      value: chatarra
      objectReference: {fileID: 0}
    - target: {fileID: 400000, guid: 0dafbae71666f874b859bc029977b27b, type: 3}
      propertyPath: m_LocalPosition.x
      value: 6.8286095
      objectReference: {fileID: 0}
    - target: {fileID: 400000, guid: 0dafbae71666f874b859bc029977b27b, type: 3}
      propertyPath: m_LocalPosition.y
      value: 0.444
      objectReference: {fileID: 0}
    - target: {fileID: 400000, guid: 0dafbae71666f874b859bc029977b27b, type: 3}
      propertyPath: m_LocalPosition.z
      value: -2.7264316
      objectReference: {fileID: 0}
    - target: {fileID: 400000, guid: 0dafbae71666f874b859bc029977b27b, type: 3}
      propertyPath: m_LocalRotation.x
      value: -0.7071068
      objectReference: {fileID: 0}
    - target: {fileID: 400000, guid: 0dafbae71666f874b859bc029977b27b, type: 3}
      propertyPath: m_LocalRotation.y
      value: 0
      objectReference: {fileID: 0}
    - target: {fileID: 400000, guid: 0dafbae71666f874b859bc029977b27b, type: 3}
      propertyPath: m_LocalRotation.z
      value: -0
      objectReference: {fileID: 0}
    - target: {fileID: 400000, guid: 0dafbae71666f874b859bc029977b27b, type: 3}
      propertyPath: m_LocalRotation.w
      value: 0.7071068
      objectReference: {fileID: 0}
    - target: {fileID: 400000, guid: 0dafbae71666f874b859bc029977b27b, type: 3}
      propertyPath: m_RootOrder
      value: 0
      objectReference: {fileID: 0}
    - target: {fileID: 400000, guid: 0dafbae71666f874b859bc029977b27b, type: 3}
      propertyPath: m_LocalEulerAnglesHint.x
      value: 0
      objectReference: {fileID: 0}
    - target: {fileID: 400000, guid: 0dafbae71666f874b859bc029977b27b, type: 3}
      propertyPath: m_LocalEulerAnglesHint.y
      value: 0
      objectReference: {fileID: 0}
    - target: {fileID: 400000, guid: 0dafbae71666f874b859bc029977b27b, type: 3}
      propertyPath: m_LocalEulerAnglesHint.z
      value: 0
      objectReference: {fileID: 0}
    - target: {fileID: 400000, guid: 0dafbae71666f874b859bc029977b27b, type: 3}
      propertyPath: m_LocalScale.x
      value: 5
      objectReference: {fileID: 0}
    - target: {fileID: 400000, guid: 0dafbae71666f874b859bc029977b27b, type: 3}
      propertyPath: m_LocalScale.y
      value: 5
      objectReference: {fileID: 0}
    - target: {fileID: 400000, guid: 0dafbae71666f874b859bc029977b27b, type: 3}
      propertyPath: m_LocalScale.z
      value: 5
      objectReference: {fileID: 0}
    m_RemovedComponents: []
  m_SourcePrefab: {fileID: 100100000, guid: 0dafbae71666f874b859bc029977b27b, type: 3}
--- !u!1 &6791016303459602696 stripped
GameObject:
  m_CorrespondingSourceObject: {fileID: 100000, guid: 0dafbae71666f874b859bc029977b27b,
    type: 3}
  m_PrefabInstance: {fileID: 6791016303459637160}
  m_PrefabAsset: {fileID: 0}
