# Blender v2.82 (sub 7) OBJ File: 'bomba.blend'
# www.blender.org
mtllib bomba.mtl
o Sphere
v 0.000000 0.831470 -0.555570
v 0.000000 0.923880 -0.382683
v 0.095671 0.923880 -0.357049
v 0.138893 0.831470 -0.518354
v 0.191342 0.923880 -0.331414
v 0.277785 0.831470 -0.481138
v 0.000000 -0.555570 -0.831470
v -0.000000 -0.469127 -0.877675
v 0.230970 -0.469127 -0.815786
v 0.207867 -0.555570 -0.775772
v -0.000000 -0.382683 -0.923880
v 0.230970 -0.382683 -0.861991
v 0.461940 -0.382683 -0.800103
v 0.438837 -0.469127 -0.760088
v 0.415735 -0.555570 -0.720074
v 0.315669 0.769288 -0.546755
v 0.176777 0.707107 -0.659740
v 0.353554 0.707107 -0.612372
v 0.000000 0.707107 -0.707107
v 0.384644 -0.631338 -0.666223
v 0.176777 -0.707107 -0.659740
v 0.353554 -0.707107 -0.612372
v 0.000000 -0.707107 -0.707107
v 0.000000 0.555570 -0.831470
v 0.000000 0.631338 -0.769288
v 0.176777 0.631338 -0.721921
v 0.207867 0.555570 -0.775772
v 0.384644 0.631338 -0.666223
v 0.415735 0.555570 -0.720074
v 0.000000 -0.831470 -0.555570
v 0.000000 -0.769288 -0.631338
v 0.138893 -0.831470 -0.518354
v 0.277785 -0.831470 -0.481138
v 0.000000 0.382683 -0.923880
v 0.230970 0.382683 -0.861991
v 0.461940 0.382683 -0.800103
v 0.000000 -0.923880 -0.382683
v 0.000000 -0.877675 -0.469127
v 0.138893 -0.877675 -0.431911
v 0.095671 -0.923880 -0.357048
v 0.234564 -0.877675 -0.406276
v 0.191342 -0.923880 -0.331413
v 0.000000 0.195090 -0.980785
v 0.000000 0.288887 -0.952332
v 0.230970 0.288887 -0.890444
v 0.245196 0.195090 -0.915085
v 0.476166 0.288887 -0.824744
v 0.490393 0.195090 -0.849385
v -0.000000 -0.980785 -0.195090
v 0.048773 -0.980785 -0.182021
v 0.097545 -0.980785 -0.168953
v 0.495196 0.097545 -0.857705
v 0.250000 0.000000 -0.933013
v 0.500000 0.000000 -0.866025
v 0.000000 0.000000 -1.000000
v -0.000000 0.980785 -0.195090
v -0.000000 1.000000 0.000000
v 0.097545 0.980785 -0.168953
v 0.048773 -0.990393 -0.084476
v 0.000000 -1.000000 0.000000
v 0.000000 -0.195090 -0.980785
v 0.000000 -0.097545 -0.990393
v 0.245196 -0.195090 -0.915085
v 0.490393 -0.195090 -0.849385
v -0.000000 0.952332 -0.288887
v 0.144444 0.952332 -0.250183
v -0.000000 -0.288887 -0.952332
v 0.245196 -0.288887 -0.886632
v 0.476166 -0.288887 -0.824744
v 0.133249 0.980785 -0.133249
v 0.261378 0.923880 -0.261378
v 0.168953 0.980785 -0.097545
v 0.331414 0.923880 -0.191342
v 0.655663 -0.288887 -0.645248
v 0.631022 -0.382683 -0.631021
v 0.669889 -0.195090 -0.669889
v 0.849385 -0.195090 -0.490392
v 0.824744 -0.288887 -0.476166
v 0.800103 -0.382683 -0.461940
v 0.406276 0.877675 -0.234563
v 0.379462 0.831470 -0.379461
v 0.481138 0.831470 -0.277785
v 0.607919 -0.469127 -0.591007
v 0.567905 -0.555570 -0.567904
v 0.760089 -0.469127 -0.438837
v 0.720074 -0.555570 -0.415735
v 0.482963 0.707107 -0.482963
v 0.612373 0.707107 -0.353553
v 0.536814 -0.631338 -0.514053
v 0.482963 -0.707107 -0.482963
v 0.666223 -0.631338 -0.384644
v 0.612373 -0.707107 -0.353553
v 0.567905 0.555570 -0.567904
v 0.720074 0.555570 -0.415735
v 0.379462 -0.831470 -0.379461
v 0.481138 -0.831470 -0.277785
v 0.760089 0.469127 -0.438837
v 0.631022 0.382683 -0.631021
v 0.800103 0.382683 -0.461940
v 0.406276 -0.877675 -0.234563
v 0.331414 -0.923880 -0.191341
v 0.669889 0.195090 -0.669889
v 0.849385 0.195090 -0.490392
v 0.250183 -0.952332 -0.144443
v 0.133249 -0.980785 -0.133249
v 0.168953 -0.980785 -0.097545
v 0.683013 0.000000 -0.683013
v 0.866026 0.000000 -0.500000
v 0.084477 0.990393 -0.048772
v 0.084477 -0.990393 -0.048772
v 0.857705 -0.097545 -0.495196
v 0.775772 0.555570 -0.207867
v 0.861992 0.382683 -0.230970
v 0.831470 0.555570 0.000000
v 0.923880 0.382683 0.000000
v 0.518354 -0.831470 -0.138892
v 0.357049 -0.923880 -0.095671
v 0.555570 -0.831470 0.000000
v 0.382684 -0.923880 0.000000
v 0.952333 0.288887 0.000000
v 0.915085 0.195090 -0.245196
v 0.980786 0.195090 0.000000
v 0.195090 -0.980785 0.000000
v 0.990393 0.097545 0.000000
v 0.933013 0.000000 -0.250000
v 1.000000 0.000000 0.000000
v 0.097545 0.990393 0.000000
v 0.195091 0.980785 0.000000
v 0.097545 -0.990393 0.000000
v 0.915085 -0.195090 -0.245196
v 0.980786 -0.195090 0.000000
v 0.382684 0.923880 0.000000
v 0.890445 -0.288887 -0.230970
v 0.861992 -0.382683 -0.230970
v 0.952333 -0.288887 0.000000
v 0.923880 -0.382683 0.000000
v 0.555571 0.831470 0.000000
v 0.518354 0.831470 -0.138892
v 0.469127 0.877675 0.000000
v 0.821977 -0.469127 -0.207867
v 0.775772 -0.555570 -0.207867
v 0.877675 -0.469127 0.000000
v 0.831470 -0.555570 0.000000
v 0.631339 0.769288 0.000000
v 0.659740 0.707107 -0.176776
v 0.707107 0.707107 0.000000
v 0.659740 -0.707107 -0.176776
v 0.707107 -0.707107 0.000000
v 0.769289 0.631338 0.000000
v 0.631339 -0.769288 0.000000
v 0.886633 -0.288887 0.245197
v 0.861992 -0.382683 0.230970
v 0.915085 -0.195090 0.245197
v 0.849385 -0.195090 0.490393
v 0.824744 -0.288887 0.476167
v 0.800103 -0.382683 0.461940
v 0.357049 0.923880 0.095671
v 0.518354 0.831470 0.138893
v 0.331414 0.923880 0.191342
v 0.481138 0.831470 0.277786
v 0.815787 -0.469127 0.230970
v 0.775772 -0.555570 0.207868
v 0.760089 -0.469127 0.438838
v 0.720074 -0.555570 0.415735
v 0.659740 0.707107 0.176777
v 0.612373 0.707107 0.353554
v 0.666223 -0.631338 0.384645
v 0.659740 -0.707107 0.176777
v 0.612373 -0.707107 0.353554
v 0.721921 0.631338 0.176777
v 0.775772 0.555570 0.207868
v 0.666223 0.631338 0.384645
v 0.720074 0.555570 0.415735
v 0.518354 -0.831470 0.138893
v 0.481138 -0.831470 0.277786
v 0.861992 0.382683 0.230970
v 0.800103 0.382683 0.461940
v 0.406276 -0.877675 0.234564
v 0.331414 -0.923880 0.191342
v 0.890444 0.288887 0.230970
v 0.915085 0.195090 0.245197
v 0.824744 0.288887 0.476167
v 0.849385 0.195090 0.490393
v 0.168953 -0.980785 0.097546
v 0.933013 0.000000 0.250000
v 0.866026 0.000000 0.500000
v 0.084477 0.990393 0.048773
v 0.168953 0.980785 0.097546
v 0.084477 -0.990393 0.048773
v 0.857705 -0.097545 0.495197
v 0.250184 0.952332 0.144444
v 0.379462 -0.831470 0.379462
v 0.261378 -0.923880 0.261378
v 0.277785 -0.831470 0.481138
v 0.191342 -0.923880 0.331414
v 0.655663 0.288887 0.645248
v 0.669889 0.195090 0.669889
v 0.631022 0.382683 0.631022
v 0.461940 0.382683 0.800104
v 0.476166 0.288887 0.824745
v 0.490393 0.195090 0.849386
v 0.144443 -0.952332 0.250184
v 0.133249 -0.980785 0.133250
v 0.097545 -0.980785 0.168954
v 0.495196 0.097545 0.857706
v 0.683013 0.000000 0.683013
v 0.500000 0.000000 0.866026
v 0.048773 0.990393 0.084477
v 0.133249 0.980785 0.133250
v 0.097545 0.980785 0.168954
v 0.048773 -0.990393 0.084477
v 0.669889 -0.195090 0.669889
v 0.490393 -0.195090 0.849386
v 0.261378 0.923880 0.261378
v 0.191342 0.923880 0.331414
v 0.631022 -0.382683 0.631022
v 0.461940 -0.382683 0.800104
v 0.234564 0.877675 0.406276
v 0.379462 0.831470 0.379462
v 0.277785 0.831470 0.481138
v 0.591007 -0.469127 0.607920
v 0.567905 -0.555570 0.567905
v 0.438837 -0.469127 0.760089
v 0.415735 -0.555570 0.720074
v 0.482963 0.707107 0.482963
v 0.353554 0.707107 0.612373
v 0.514054 -0.631338 0.536814
v 0.482963 -0.707107 0.482963
v 0.384644 -0.631338 0.666224
v 0.353554 -0.707107 0.612373
v 0.567905 0.555570 0.567905
v 0.415735 0.555570 0.720074
v 0.438837 0.469127 0.760089
v 0.000000 0.831470 0.555571
v 0.138893 0.831470 0.518355
v 0.000000 0.877675 0.469127
v 0.000000 0.923880 0.382684
v 0.230970 -0.382683 0.861992
v 0.207867 -0.555570 0.775772
v -0.000000 -0.382683 0.923880
v -0.000000 -0.555570 0.831470
v 0.176777 0.707107 0.659740
v -0.000000 0.707107 0.707107
v 0.176777 -0.707107 0.659740
v -0.000000 -0.707107 0.707107
v -0.000000 0.631338 0.769289
v 0.207867 0.555570 0.775772
v -0.000000 0.555570 0.831470
v -0.000000 -0.769288 0.631339
v -0.000000 -0.831470 0.555571
v -0.000000 0.382683 0.923880
v -0.000000 -0.923880 0.382684
v -0.000000 0.195090 0.980786
v 0.245196 0.195090 0.915086
v -0.000000 0.288887 0.952333
v -0.000000 -0.952332 0.288887
v -0.000000 -0.980785 0.195091
v 0.250000 0.097545 0.923406
v 0.250000 0.000000 0.933013
v -0.000000 0.097545 0.990393
v -0.000000 0.000000 1.000000
v -0.000000 0.990393 0.097546
v -0.000000 0.980785 0.195091
v -0.000000 -0.990393 0.097546
v 0.245196 -0.195090 0.915086
v -0.000000 -0.195090 0.980786
v -0.000000 -0.288887 0.952333
v -0.230970 0.288887 0.890445
v -0.245196 0.195090 0.915086
v -0.230970 0.382683 0.861992
v -0.461940 0.382683 0.800104
v -0.476166 0.288887 0.824745
v -0.490393 0.195090 0.849385
v -0.095671 -0.923880 0.357049
v -0.191342 -0.923880 0.331414
v -0.097545 -0.980785 0.168954
v -0.250000 0.000000 0.933013
v -0.500000 0.000000 0.866026
v -0.048773 0.990393 0.084477
v -0.097545 0.980785 0.168954
v -0.048773 -0.990393 0.084477
v -0.495196 -0.097545 0.857706
v -0.245196 -0.195090 0.915086
v -0.490393 -0.195090 0.849386
v -0.144444 0.952332 0.250184
v -0.095671 0.923880 0.357049
v -0.191342 0.923880 0.331414
v -0.230970 -0.382683 0.861992
v -0.461940 -0.382683 0.800104
v -0.138893 0.831470 0.518355
v -0.277785 0.831470 0.481138
v -0.438838 -0.469127 0.760089
v -0.207868 -0.555570 0.775772
v -0.415735 -0.555570 0.720074
v -0.315669 0.769288 0.546756
v -0.353554 0.707107 0.612373
v -0.176777 -0.707107 0.659740
v -0.353554 -0.707107 0.612373
v -0.415735 0.555570 0.720074
v -0.207868 0.555570 0.775772
v -0.384644 0.631338 0.666224
v -0.176777 -0.769288 0.583972
v -0.138893 -0.831470 0.518355
v -0.315669 -0.769288 0.546756
v -0.277785 -0.831470 0.481138
v -0.234564 -0.877675 0.406276
v -0.631022 -0.382683 0.631022
v -0.567905 -0.555570 0.567905
v -0.800103 -0.382683 0.461940
v -0.720074 -0.555570 0.415735
v -0.417346 0.769288 0.445079
v -0.482963 0.707107 0.482963
v -0.379462 0.831470 0.379462
v -0.481138 0.831470 0.277786
v -0.546755 0.769288 0.315670
v -0.612373 0.707107 0.353554
v -0.666223 -0.631338 0.384645
v -0.482963 -0.707107 0.482963
v -0.612373 -0.707107 0.353554
v -0.514054 0.631338 0.536814
v -0.567905 0.555570 0.567905
v -0.666223 0.631338 0.384645
v -0.720074 0.555570 0.415735
v -0.379462 -0.831470 0.379462
v -0.481138 -0.831470 0.277786
v -0.631022 0.382683 0.631022
v -0.800103 0.382683 0.461940
v -0.261378 -0.923880 0.261378
v -0.331414 -0.923880 0.191342
v -0.669889 0.195090 0.669889
v -0.849385 0.195090 0.490393
v -0.250183 -0.952332 0.144444
v -0.168953 -0.980785 0.097546
v -0.857705 0.097545 0.495197
v -0.683013 0.000000 0.683013
v -0.866026 0.000000 0.500000
v -0.133249 0.980785 0.133250
v -0.168953 0.980785 0.097546
v -0.084477 -0.990393 0.048773
v -0.678209 -0.097545 0.674693
v -0.669889 -0.195090 0.669889
v -0.857705 -0.097545 0.495197
v -0.849385 -0.195090 0.490393
v -0.180148 0.952332 0.214480
v -0.261378 0.923880 0.261378
v -0.250184 0.952332 0.144444
v -0.331414 0.923880 0.191342
v -0.382684 -0.923880 0.000000
v -0.288887 -0.952332 0.000000
v -0.195090 -0.980785 0.000000
v -0.923406 0.097545 0.250000
v -0.933013 0.000000 0.250000
v -0.915085 0.195090 0.245197
v -0.980785 0.195090 0.000000
v -0.990393 0.097545 0.000000
v -1.000000 0.000000 0.000000
v -0.195091 0.980785 0.000000
v -0.097545 -0.990393 0.000000
v -0.924693 -0.097545 0.245197
v -0.915085 -0.195090 0.245197
v -0.990393 -0.097545 0.000000
v -0.980785 -0.195090 0.000000
v -0.382684 0.923880 0.000000
v -0.357049 0.923880 0.095671
v -0.288887 0.952332 0.000000
v -0.952333 -0.288887 0.000000
v -0.861992 -0.382683 0.230970
v -0.923880 -0.382683 0.000000
v -0.518354 0.831470 0.138893
v -0.555570 0.831470 0.000000
v -0.775772 -0.555570 0.207868
v -0.831470 -0.555570 0.000000
v -0.659740 0.707107 0.176777
v -0.707107 0.707107 0.000000
v -0.721921 -0.631338 0.176777
v -0.659740 -0.707107 0.176777
v -0.769288 -0.631338 0.000000
v -0.707107 -0.707107 0.000000
v -0.769288 0.631338 0.000000
v -0.831470 0.555570 0.000000
v -0.631339 -0.769288 0.000000
v -0.555570 -0.831470 0.000000
v -0.877675 0.469127 0.000000
v -0.861992 0.382683 0.230970
v -0.923880 0.382683 0.000000
v -0.713591 -0.631338 -0.207867
v -0.659740 -0.707107 -0.176776
v -0.775772 -0.555570 -0.207867
v -0.720074 -0.555570 -0.415735
v -0.666223 -0.631338 -0.384644
v -0.612373 -0.707107 -0.353553
v -0.721921 0.631338 -0.176777
v -0.775772 0.555570 -0.207867
v -0.659740 0.707107 -0.176776
v -0.612373 0.707107 -0.353553
v -0.666223 0.631338 -0.384644
v -0.720074 0.555570 -0.415735
v -0.518354 -0.831470 -0.138892
v -0.481138 -0.831470 -0.277785
v -0.861992 0.382683 -0.230970
v -0.800103 0.382683 -0.461940
v -0.357049 -0.923880 -0.095671
v -0.331414 -0.923880 -0.191341
v -0.824744 0.288887 -0.476166
v -0.915085 0.195090 -0.245196
v -0.849385 0.195090 -0.490393
v -0.182022 -0.980785 -0.048772
v -0.168953 -0.980785 -0.097545
v -0.933013 0.000000 -0.250000
v -0.866025 0.000000 -0.500000
v -0.168953 0.980785 -0.097545
v -0.915085 -0.195090 -0.245196
v -0.849385 -0.195090 -0.490392
v -0.250184 0.952332 -0.144443
v -0.331414 0.923880 -0.191342
v -0.886633 -0.288887 -0.245196
v -0.861992 -0.382683 -0.230970
v -0.824744 -0.288887 -0.476166
v -0.800103 -0.382683 -0.461940
v -0.406276 0.877675 -0.234563
v -0.518354 0.831470 -0.138892
v -0.481138 0.831470 -0.277785
v -0.097545 0.980785 -0.168953
v -0.097545 -0.980785 -0.168953
v -0.500000 0.000000 -0.866025
v -0.495196 -0.097545 -0.857705
v -0.669889 -0.195090 -0.669889
v -0.683013 0.000000 -0.683012
v -0.490393 -0.195090 -0.849385
v -0.191342 0.923880 -0.331413
v -0.261378 0.923880 -0.261378
v -0.144444 0.952332 -0.250183
v -0.645248 -0.288887 -0.655662
v -0.631022 -0.382683 -0.631021
v -0.476166 -0.288887 -0.824744
v -0.461940 -0.382683 -0.800103
v -0.379462 0.831470 -0.379461
v -0.277785 0.831470 -0.481138
v -0.438837 -0.469127 -0.760088
v -0.567904 -0.555570 -0.567904
v -0.415735 -0.555570 -0.720074
v -0.482963 0.707107 -0.482963
v -0.353553 0.707107 -0.612372
v -0.482963 -0.707107 -0.482963
v -0.353553 -0.707107 -0.612372
v -0.536814 0.631338 -0.514054
v -0.567904 0.555570 -0.567904
v -0.384644 0.631338 -0.666223
v -0.415735 0.555570 -0.720074
v -0.315669 -0.769288 -0.546755
v -0.379462 -0.831470 -0.379461
v -0.277785 -0.831470 -0.481138
v -0.631022 0.382683 -0.631021
v -0.461940 0.382683 -0.800103
v -0.234563 -0.877675 -0.406276
v -0.191342 -0.923880 -0.331413
v -0.655662 0.288887 -0.645248
v -0.669889 0.195090 -0.669889
v -0.476166 0.288887 -0.824744
v -0.490393 0.195090 -0.849385
vt 0.750000 0.812500
vt 0.750000 0.875000
vt 0.708333 0.875000
vt 0.708333 0.812500
vt 0.666667 0.875000
vt 0.666667 0.812500
vt 0.750000 0.312500
vt 0.750000 0.343750
vt 0.708333 0.343750
vt 0.708333 0.312500
vt 0.750000 0.375000
vt 0.708333 0.375000
vt 0.666667 0.375000
vt 0.666667 0.343750
vt 0.666667 0.312500
vt 0.666667 0.781250
vt 0.708333 0.750000
vt 0.666667 0.750000
vt 0.750000 0.750000
vt 0.666667 0.281250
vt 0.708333 0.250000
vt 0.666667 0.250000
vt 0.750000 0.250000
vt 0.750000 0.687500
vt 0.750000 0.718750
vt 0.708333 0.718750
vt 0.708333 0.687500
vt 0.666667 0.718750
vt 0.666667 0.687500
vt 0.750000 0.187500
vt 0.750000 0.218750
vt 0.708333 0.187500
vt 0.666667 0.187500
vt 0.750000 0.625000
vt 0.708333 0.625000
vt 0.666667 0.625000
vt 0.750000 0.125000
vt 0.750000 0.156250
vt 0.708333 0.156250
vt 0.708333 0.125000
vt 0.666667 0.156250
vt 0.666667 0.125000
vt 0.750000 0.562500
vt 0.750000 0.593750
vt 0.708333 0.593750
vt 0.708333 0.562500
vt 0.666667 0.593750
vt 0.666667 0.562500
vt 0.750000 0.062500
vt 0.708333 0.062500
vt 0.666667 0.062500
vt 0.666667 0.531250
vt 0.708333 0.500000
vt 0.666667 0.500000
vt 0.750000 0.500000
vt 0.750000 0.937500
vt 0.708333 1.000000
vt 0.666667 0.937500
vt 0.687500 0.031250
vt 0.708333 0.000000
vt 0.750000 0.437500
vt 0.750000 0.468750
vt 0.708333 0.437500
vt 0.666667 0.437500
vt 0.750000 0.906250
vt 0.666667 0.906250
vt 0.750000 0.406250
vt 0.708333 0.406250
vt 0.666667 0.406250
vt 0.625000 0.937500
vt 0.625000 0.875000
vt 0.583333 0.937500
vt 0.583333 0.875000
vt 0.625000 0.406250
vt 0.625000 0.375000
vt 0.625000 0.437500
vt 0.583333 0.437500
vt 0.583333 0.406250
vt 0.583333 0.375000
vt 0.583333 0.843750
vt 0.625000 0.812500
vt 0.583333 0.812500
vt 0.625000 0.343750
vt 0.625000 0.312500
vt 0.583333 0.343750
vt 0.583333 0.312500
vt 0.625000 0.750000
vt 0.583333 0.750000
vt 0.625000 0.281250
vt 0.625000 0.250000
vt 0.583333 0.281250
vt 0.583333 0.250000
vt 0.625000 0.687500
vt 0.583333 0.687500
vt 0.625000 0.187500
vt 0.583333 0.187500
vt 0.583333 0.656250
vt 0.625000 0.625000
vt 0.583333 0.625000
vt 0.583333 0.156250
vt 0.583333 0.125000
vt 0.625000 0.562500
vt 0.583333 0.562500
vt 0.583333 0.093750
vt 0.625000 0.062500
vt 0.583333 0.062500
vt 0.625000 0.500000
vt 0.583333 0.500000
vt 0.604166 0.968750
vt 0.625000 1.000000
vt 0.625000 0.000000
vt 0.645833 0.031250
vt 0.604166 0.031250
vt 0.604166 0.031250
vt 0.625000 0.062500
vt 0.583333 0.062500
vt 0.625000 0.000000
vt 0.666667 0.062500
vt 0.583333 0.468750
vt 0.541667 0.687500
vt 0.541667 0.625000
vt 0.500000 0.687500
vt 0.500000 0.625000
vt 0.541667 0.187500
vt 0.541667 0.125000
vt 0.500000 0.187500
vt 0.500000 0.125000
vt 0.500000 0.593750
vt 0.541667 0.562500
vt 0.500000 0.562500
vt 0.500000 0.062500
vt 0.500000 0.531250
vt 0.541667 0.500000
vt 0.500000 0.500000
vt 0.541666 1.000000
vt 0.520833 0.968750
vt 0.562500 0.968750
vt 0.500000 0.937500
vt 0.541666 0.000000
vt 0.562500 0.031250
vt 0.520833 0.031250
vt 0.541667 0.437500
vt 0.500000 0.437500
vt 0.500000 0.875000
vt 0.541667 0.406250
vt 0.541667 0.375000
vt 0.500000 0.406250
vt 0.500000 0.375000
vt 0.500000 0.812500
vt 0.541667 0.812500
vt 0.500000 0.843750
vt 0.541667 0.343750
vt 0.541667 0.312500
vt 0.500000 0.343750
vt 0.500000 0.312500
vt 0.500000 0.781250
vt 0.541667 0.750000
vt 0.500000 0.750000
vt 0.541667 0.250000
vt 0.500000 0.250000
vt 0.500000 0.718750
vt 0.500000 0.218750
vt 0.458333 0.406250
vt 0.458333 0.375000
vt 0.458333 0.437500
vt 0.416667 0.437500
vt 0.416667 0.406250
vt 0.416667 0.375000
vt 0.458333 0.875000
vt 0.458333 0.812500
vt 0.416667 0.875000
vt 0.416667 0.812500
vt 0.458333 0.343750
vt 0.458333 0.312500
vt 0.416667 0.343750
vt 0.416667 0.312500
vt 0.458333 0.750000
vt 0.416667 0.750000
vt 0.416667 0.281250
vt 0.458333 0.250000
vt 0.416667 0.250000
vt 0.458333 0.718750
vt 0.458333 0.687500
vt 0.416667 0.718750
vt 0.416667 0.687500
vt 0.458333 0.187500
vt 0.416667 0.187500
vt 0.458333 0.625000
vt 0.416667 0.625000
vt 0.416667 0.156250
vt 0.416667 0.125000
vt 0.458333 0.593750
vt 0.458333 0.562500
vt 0.416667 0.593750
vt 0.416667 0.562500
vt 0.416666 0.062500
vt 0.458333 0.500000
vt 0.416667 0.500000
vt 0.458333 1.000000
vt 0.437500 0.968750
vt 0.479166 0.968750
vt 0.416666 0.937500
vt 0.458333 0.000000
vt 0.479166 0.031250
vt 0.437500 0.031250
vt 0.416667 0.468750
vt 0.416666 0.906250
vt 0.375000 0.187500
vt 0.375000 0.125000
vt 0.333333 0.187500
vt 0.333333 0.125000
vt 0.375000 0.593750
vt 0.375000 0.562500
vt 0.375000 0.625000
vt 0.333333 0.625000
vt 0.333333 0.593750
vt 0.333333 0.562500
vt 0.333333 0.093750
vt 0.375000 0.062500
vt 0.333333 0.062500
vt 0.333333 0.531250
vt 0.375000 0.500000
vt 0.333333 0.500000
vt 0.395833 0.968750
vt 0.354166 0.968750
vt 0.375000 0.937500
vt 0.375000 0.937500
vt 0.354166 0.968750
vt 0.333333 0.937500
vt 0.416666 0.937500
vt 0.375000 1.000000
vt 0.333333 0.937500
vt 0.375000 0.000000
vt 0.395833 0.031250
vt 0.354166 0.031250
vt 0.354166 0.031250
vt 0.375000 0.062500
vt 0.333333 0.062500
vt 0.375000 0.000000
vt 0.416666 0.062500
vt 0.375000 0.437500
vt 0.333333 0.437500
vt 0.375000 0.875000
vt 0.333333 0.875000
vt 0.375000 0.375000
vt 0.333333 0.375000
vt 0.333333 0.843750
vt 0.375000 0.812500
vt 0.333333 0.812500
vt 0.375000 0.343750
vt 0.375000 0.312500
vt 0.333333 0.343750
vt 0.333333 0.312500
vt 0.375000 0.750000
vt 0.333333 0.750000
vt 0.375000 0.281250
vt 0.375000 0.250000
vt 0.333333 0.281250
vt 0.333333 0.250000
vt 0.375000 0.687500
vt 0.333333 0.687500
vt 0.333333 0.656250
vt 0.250000 0.812500
vt 0.291667 0.812500
vt 0.250000 0.843750
vt 0.250000 0.875000
vt 0.291667 0.375000
vt 0.291667 0.312500
vt 0.250000 0.375000
vt 0.250000 0.312500
vt 0.291667 0.750000
vt 0.250000 0.750000
vt 0.291667 0.250000
vt 0.250000 0.250000
vt 0.250000 0.718750
vt 0.291667 0.687500
vt 0.250000 0.687500
vt 0.250000 0.218750
vt 0.250000 0.187500
vt 0.250000 0.625000
vt 0.250000 0.125000
vt 0.250000 0.562500
vt 0.291667 0.562500
vt 0.250000 0.593750
vt 0.250000 0.093750
vt 0.250000 0.062500
vt 0.291667 0.531250
vt 0.291667 0.500000
vt 0.250000 0.531250
vt 0.250000 0.500000
vt 0.291666 1.000000
vt 0.270833 0.968750
vt 0.312500 0.968750
vt 0.250000 0.937500
vt 0.291667 0.000000
vt 0.312500 0.031250
vt 0.270833 0.031250
vt 0.291667 0.437500
vt 0.250000 0.437500
vt 0.250000 0.406250
vt 0.208333 0.593750
vt 0.208333 0.562500
vt 0.208333 0.625000
vt 0.166667 0.625000
vt 0.166667 0.593750
vt 0.166667 0.562500
vt 0.208333 0.125000
vt 0.166667 0.125000
vt 0.166667 0.062500
vt 0.208333 0.500000
vt 0.166667 0.500000
vt 0.208333 1.000000
vt 0.187500 0.968750
vt 0.229167 0.968750
vt 0.166667 0.937500
vt 0.208333 0.000000
vt 0.229167 0.031250
vt 0.187500 0.031250
vt 0.166667 0.468750
vt 0.208333 0.437500
vt 0.166667 0.437500
vt 0.166667 0.906250
vt 0.208333 0.875000
vt 0.166667 0.875000
vt 0.208333 0.375000
vt 0.166667 0.375000
vt 0.208333 0.812500
vt 0.166667 0.812500
vt 0.166667 0.343750
vt 0.208333 0.312500
vt 0.166667 0.312500
vt 0.166667 0.781250
vt 0.166667 0.750000
vt 0.208333 0.250000
vt 0.166667 0.250000
vt 0.166667 0.687500
vt 0.208333 0.687500
vt 0.166667 0.718750
vt 0.208333 0.218750
vt 0.208333 0.187500
vt 0.166667 0.218750
vt 0.166667 0.187500
vt 0.166667 0.156250
vt 0.125000 0.375000
vt 0.125000 0.312500
vt 0.083333 0.375000
vt 0.083333 0.312500
vt 0.125000 0.781250
vt 0.125000 0.750000
vt 0.125000 0.812500
vt 0.083333 0.812500
vt 0.083333 0.781250
vt 0.083333 0.750000
vt 0.083333 0.281250
vt 0.125000 0.250000
vt 0.083333 0.250000
vt 0.125000 0.718750
vt 0.125000 0.687500
vt 0.083333 0.718750
vt 0.083333 0.687500
vt 0.125000 0.187500
vt 0.083333 0.187500
vt 0.125000 0.625000
vt 0.083333 0.625000
vt 0.125000 0.125000
vt 0.083333 0.125000
vt 0.125000 0.562500
vt 0.083333 0.562500
vt 0.083333 0.093750
vt 0.083334 0.062500
vt 0.083333 0.531250
vt 0.125000 0.500000
vt 0.083333 0.500000
vt 0.145834 0.968750
vt 0.125000 0.937500
vt 0.125000 1.000000
vt 0.083334 0.937500
vt 0.125000 0.000000
vt 0.145834 0.031250
vt 0.104167 0.031250
vt 0.125000 0.468750
vt 0.125000 0.437500
vt 0.083333 0.468750
vt 0.083333 0.437500
vt 0.125000 0.906250
vt 0.125000 0.875000
vt 0.083333 0.906250
vt 0.083333 0.875000
vt 0.000000 0.125000
vt 0.000000 0.093750
vt 0.000000 0.062500
vt 0.041667 0.531250
vt 0.041667 0.500000
vt 0.041667 0.562500
vt 0.000000 0.562500
vt 0.000000 0.531250
vt 0.000000 0.500000
vt 0.041667 1.000000
vt 0.000000 0.937500
vt 0.041667 0.000000
vt 0.062500 0.031250
vt 0.020834 0.031250
vt 0.041667 0.468750
vt 0.041667 0.437500
vt 0.000000 0.468750
vt 0.000000 0.437500
vt 0.000000 0.875000
vt 0.041667 0.875000
vt 0.000000 0.906250
vt 0.000000 0.406250
vt 0.041667 0.375000
vt 0.000000 0.375000
vt 0.041667 0.812500
vt 0.000000 0.812500
vt 0.041667 0.312500
vt 0.000000 0.312500
vt 0.041667 0.750000
vt 0.000000 0.750000
vt 0.041667 0.281250
vt 0.041667 0.250000
vt 0.000000 0.281250
vt 0.000000 0.250000
vt 0.000000 0.718750
vt 0.000000 0.687500
vt 0.000000 0.218750
vt 0.000000 0.187500
vt 0.000000 0.656250
vt 0.041667 0.625000
vt 0.000000 0.625000
vt 1.000000 0.250000
vt 1.000000 0.281250
vt 0.958333 0.281250
vt 0.958333 0.250000
vt 1.000000 0.312500
vt 0.958333 0.312500
vt 0.916667 0.312500
vt 0.916667 0.281250
vt 0.916667 0.250000
vt 1.000000 0.687500
vt 1.000000 0.718750
vt 0.958333 0.718750
vt 0.958333 0.687500
vt 1.000000 0.750000
vt 0.958333 0.750000
vt 0.916667 0.750000
vt 0.916667 0.718750
vt 0.916667 0.687500
vt 1.000000 0.187500
vt 1.000000 0.218750
vt 0.958333 0.187500
vt 0.916667 0.187500
vt 1.000000 0.625000
vt 1.000000 0.656250
vt 0.958333 0.625000
vt 0.916667 0.625000
vt 1.000000 0.125000
vt 0.958333 0.125000
vt 0.916667 0.125000
vt 0.916667 0.593750
vt 0.958333 0.562500
vt 0.916667 0.562500
vt 1.000000 0.562500
vt 1.000000 0.062500
vt 1.000000 0.093750
vt 0.958334 0.062500
vt 0.916667 0.062500
vt 1.000000 0.500000
vt 1.000000 0.531250
vt 0.958333 0.500000
vt 0.916667 0.500000
vt 1.000000 0.937500
vt 0.958334 1.000000
vt 0.916667 0.937500
vt 0.979167 0.031250
vt 0.958334 0.000000
vt 1.000000 0.437500
vt 1.000000 0.468750
vt 0.958333 0.437500
vt 0.916667 0.437500
vt 0.916667 0.906250
vt 1.000000 0.906250
vt 0.916667 0.875000
vt 1.000000 0.875000
vt 1.000000 0.375000
vt 1.000000 0.406250
vt 0.958333 0.406250
vt 0.958333 0.375000
vt 0.916667 0.406250
vt 0.916667 0.375000
vt 0.916667 0.843750
vt 0.958333 0.812500
vt 1.000000 0.812500
vt 0.916667 0.812500
vt 0.875000 1.000000
vt 0.833333 0.937500
vt 0.875000 0.000000
vt 0.833333 0.062500
vt 0.833333 0.500000
vt 0.833333 0.468750
vt 0.875000 0.437500
vt 0.875000 0.500000
vt 0.833333 0.437500
vt 0.833333 0.875000
vt 0.875000 0.875000
vt 0.833333 0.906250
vt 0.875000 0.406250
vt 0.875000 0.375000
vt 0.833333 0.406250
vt 0.833333 0.375000
vt 0.875000 0.812500
vt 0.833333 0.812500
vt 0.833333 0.343750
vt 0.875000 0.312500
vt 0.833333 0.312500
vt 0.875000 0.750000
vt 0.833333 0.750000
vt 0.875000 0.250000
vt 0.833333 0.250000
vt 0.875000 0.718750
vt 0.875000 0.687500
vt 0.833333 0.718750
vt 0.833333 0.687500
vt 0.833333 0.218750
vt 0.875000 0.187500
vt 0.833333 0.187500
vt 0.875000 0.625000
vt 0.833333 0.625000
vt 0.833333 0.156250
vt 0.833333 0.125000
vt 0.875000 0.593750
vt 0.875000 0.562500
vt 0.833333 0.593750
vt 0.833333 0.562500
vt 0.791667 1.000000
vt 0.791667 0.000000
vn 0.1253 0.8750 -0.4677
vn 0.2300 -0.4588 -0.8583
vn 0.1676 0.7621 -0.6254
vn 0.2028 -0.6212 -0.7569
vn 0.2028 0.6212 -0.7569
vn 0.1676 -0.7621 -0.6254
vn 0.2300 0.4588 -0.8583
vn 0.1253 -0.8750 -0.4677
vn 0.2484 0.2812 -0.9270
vn 0.0775 -0.9541 -0.2894
vn 0.2577 0.0947 -0.9616
vn 0.0263 0.9948 -0.0980
vn 0.0263 -0.9948 -0.0980
vn 0.2577 -0.0947 -0.9616
vn 0.0775 0.9541 -0.2894
vn 0.2484 -0.2812 -0.9270
vn 0.2119 0.9541 -0.2119
vn 0.6786 -0.2812 -0.6786
vn 0.3424 0.8750 -0.3424
vn 0.6283 -0.4588 -0.6283
vn 0.4578 0.7621 -0.4578
vn 0.5541 -0.6212 -0.5541
vn 0.5541 0.6212 -0.5541
vn 0.4578 -0.7621 -0.4578
vn 0.6283 0.4588 -0.6283
vn 0.3424 -0.8750 -0.3424
vn 0.6786 0.2812 -0.6786
vn 0.2119 -0.9541 -0.2119
vn 0.7039 0.0947 -0.7039
vn 0.0717 0.9948 -0.0717
vn 0.0717 -0.9948 -0.0717
vn 0.7039 -0.0947 -0.7039
vn 0.8583 0.4588 -0.2300
vn 0.4677 -0.8750 -0.1253
vn 0.9270 0.2812 -0.2484
vn 0.2894 -0.9541 -0.0775
vn 0.9616 0.0947 -0.2577
vn 0.0980 0.9948 -0.0263
vn 0.0980 -0.9948 -0.0263
vn 0.9616 -0.0947 -0.2577
vn 0.2894 0.9541 -0.0775
vn 0.9270 -0.2812 -0.2484
vn 0.4677 0.8750 -0.1253
vn 0.8583 -0.4588 -0.2300
vn 0.6254 0.7621 -0.1676
vn 0.7569 -0.6212 -0.2028
vn 0.7569 0.6212 -0.2028
vn 0.6254 -0.7621 -0.1676
vn 0.9270 -0.2812 0.2484
vn 0.4677 0.8750 0.1253
vn 0.8583 -0.4588 0.2300
vn 0.6254 0.7621 0.1676
vn 0.7569 -0.6212 0.2028
vn 0.7569 0.6212 0.2028
vn 0.6254 -0.7621 0.1676
vn 0.8583 0.4588 0.2300
vn 0.4677 -0.8750 0.1253
vn 0.9270 0.2812 0.2484
vn 0.2894 -0.9541 0.0775
vn 0.9616 0.0947 0.2577
vn 0.0980 0.9948 0.0263
vn 0.0980 -0.9948 0.0263
vn 0.9616 -0.0947 0.2577
vn 0.2894 0.9541 0.0775
vn 0.3424 -0.8750 0.3424
vn 0.6786 0.2812 0.6786
vn 0.2119 -0.9541 0.2119
vn 0.7039 0.0947 0.7039
vn 0.0717 0.9948 0.0717
vn 0.0717 -0.9948 0.0717
vn 0.7039 -0.0947 0.7039
vn 0.2119 0.9541 0.2119
vn 0.6786 -0.2812 0.6786
vn 0.3424 0.8750 0.3424
vn 0.6283 -0.4588 0.6283
vn 0.4578 0.7621 0.4578
vn 0.5541 -0.6212 0.5541
vn 0.5541 0.6212 0.5541
vn 0.4578 -0.7621 0.4578
vn 0.6283 0.4588 0.6283
vn 0.1253 0.8750 0.4677
vn 0.2300 -0.4588 0.8583
vn 0.1676 0.7621 0.6254
vn 0.2028 -0.6212 0.7569
vn 0.2028 0.6212 0.7569
vn 0.1676 -0.7621 0.6254
vn 0.2300 0.4588 0.8583
vn 0.1253 -0.8750 0.4677
vn 0.2484 0.2812 0.9270
vn 0.0775 -0.9541 0.2894
vn 0.2577 0.0947 0.9616
vn 0.0263 0.9948 0.0980
vn 0.0263 -0.9948 0.0980
vn 0.2577 -0.0947 0.9616
vn 0.0775 0.9541 0.2894
vn 0.2484 -0.2812 0.9270
vn -0.2484 0.2812 0.9270
vn -0.0775 -0.9541 0.2894
vn -0.2577 0.0947 0.9616
vn -0.0263 0.9948 0.0980
vn -0.0263 -0.9948 0.0980
vn -0.2577 -0.0947 0.9616
vn -0.0775 0.9541 0.2894
vn -0.2484 -0.2812 0.9270
vn -0.1253 0.8750 0.4677
vn -0.2300 -0.4588 0.8583
vn -0.1676 0.7621 0.6254
vn -0.2028 -0.6212 0.7569
vn -0.2028 0.6212 0.7569
vn -0.1676 -0.7621 0.6254
vn -0.2300 0.4588 0.8583
vn -0.1253 -0.8750 0.4677
vn -0.6283 -0.4588 0.6283
vn -0.4578 0.7621 0.4578
vn -0.5541 -0.6212 0.5541
vn -0.5541 0.6212 0.5541
vn -0.4578 -0.7621 0.4578
vn -0.6283 0.4588 0.6283
vn -0.3424 -0.8750 0.3424
vn -0.6786 0.2812 0.6786
vn -0.2119 -0.9541 0.2119
vn -0.7039 0.0947 0.7039
vn -0.0717 0.9948 0.0717
vn -0.0717 -0.9948 0.0717
vn -0.7039 -0.0947 0.7039
vn -0.2119 0.9541 0.2119
vn -0.6786 -0.2812 0.6786
vn -0.3424 0.8750 0.3424
vn -0.2894 -0.9541 0.0775
vn -0.9616 0.0947 0.2577
vn -0.0980 0.9948 0.0263
vn -0.0980 -0.9948 0.0263
vn -0.9616 -0.0947 0.2577
vn -0.2894 0.9541 0.0775
vn -0.9270 -0.2812 0.2484
vn -0.4677 0.8750 0.1253
vn -0.8583 -0.4588 0.2300
vn -0.6254 0.7621 0.1676
vn -0.7569 -0.6212 0.2028
vn -0.7569 0.6212 0.2028
vn -0.6254 -0.7621 0.1676
vn -0.8583 0.4588 0.2300
vn -0.4677 -0.8750 0.1253
vn -0.9270 0.2812 0.2484
vn -0.7569 -0.6212 -0.2028
vn -0.7569 0.6212 -0.2028
vn -0.6254 -0.7621 -0.1676
vn -0.8583 0.4588 -0.2300
vn -0.4677 -0.8750 -0.1253
vn -0.9270 0.2812 -0.2484
vn -0.2894 -0.9541 -0.0775
vn -0.9616 0.0947 -0.2577
vn -0.0980 0.9948 -0.0263
vn -0.0980 -0.9948 -0.0263
vn -0.9616 -0.0947 -0.2577
vn -0.2894 0.9541 -0.0775
vn -0.9270 -0.2812 -0.2484
vn -0.4677 0.8750 -0.1253
vn -0.8583 -0.4588 -0.2300
vn -0.6254 0.7621 -0.1676
vn -0.0717 0.9948 -0.0717
vn -0.0717 -0.9948 -0.0717
vn -0.7039 -0.0947 -0.7039
vn -0.2119 0.9541 -0.2119
vn -0.6786 -0.2812 -0.6786
vn -0.3424 0.8750 -0.3424
vn -0.6283 -0.4588 -0.6283
vn -0.4578 0.7621 -0.4578
vn -0.5541 -0.6212 -0.5541
vn -0.5541 0.6212 -0.5541
vn -0.4578 -0.7621 -0.4578
vn -0.6283 0.4588 -0.6283
vn -0.3424 -0.8750 -0.3424
vn -0.6786 0.2812 -0.6786
vn -0.2119 -0.9541 -0.2119
vn -0.7039 0.0947 -0.7039
vn -0.2028 0.6212 -0.7569
vn -0.1676 -0.7621 -0.6254
vn -0.2300 0.4588 -0.8583
vn -0.1253 -0.8750 -0.4677
vn -0.2484 0.2812 -0.9270
vn -0.0775 -0.9541 -0.2894
vn -0.2577 0.0947 -0.9616
vn -0.0263 0.9948 -0.0980
vn -0.0263 -0.9948 -0.0980
vn -0.2577 -0.0947 -0.9616
vn -0.0775 0.9541 -0.2894
vn -0.2484 -0.2812 -0.9270
vn -0.1253 0.8750 -0.4677
vn -0.2300 -0.4588 -0.8583
vn -0.1676 0.7621 -0.6254
vn -0.2028 -0.6212 -0.7569
usemtl Explode_Fade
s off
f 1/1/1 2/2/1 3/3/1 4/4/1
f 4/4/1 3/3/1 5/5/1 6/6/1
f 7/7/2 8/8/2 9/9/2 10/10/2
f 8/8/2 11/11/2 12/12/2 9/9/2
f 9/9/2 12/12/2 13/13/2 14/14/2
f 10/10/2 9/9/2 14/14/2 15/15/2
f 6/6/3 16/16/3 17/17/3 4/4/3
f 16/16/3 18/18/3 17/17/3
f 19/19/3 1/1/3 4/4/3 17/17/3
f 15/15/4 20/20/4 21/21/4 10/10/4
f 20/20/4 22/22/4 21/21/4
f 10/10/4 21/21/4 23/23/4 7/7/4
f 24/24/5 25/25/5 26/26/5 27/27/5
f 25/25/5 19/19/5 17/17/5 26/26/5
f 26/26/5 17/17/5 18/18/5 28/28/5
f 27/27/5 26/26/5 28/28/5 29/29/5
f 30/30/6 31/31/6 21/21/6 32/32/6
f 31/31/6 23/23/6 21/21/6
f 32/32/6 21/21/6 22/22/6 33/33/6
f 34/34/7 24/24/7 27/27/7 35/35/7
f 35/35/7 27/27/7 29/29/7 36/36/7
f 37/37/8 38/38/8 39/39/8 40/40/8
f 38/38/8 30/30/8 32/32/8 39/39/8
f 39/39/8 32/32/8 33/33/8 41/41/8
f 40/40/8 39/39/8 41/41/8 42/42/8
f 43/43/9 44/44/9 45/45/9 46/46/9
f 44/44/9 34/34/9 35/35/9 45/45/9
f 45/45/9 35/35/9 36/36/9 47/47/9
f 46/46/9 45/45/9 47/47/9 48/48/9
f 49/49/10 37/37/10 40/40/10 50/50/10
f 50/50/10 40/40/10 42/42/10 51/51/10
f 48/48/11 52/52/11 53/53/11 46/46/11
f 52/52/11 54/54/11 53/53/11
f 46/46/11 53/53/11 55/55/11 43/43/11
f 56/56/12 57/57/12 58/58/12
f 51/51/13 59/59/13 50/50/13
f 59/59/13 60/60/13 49/49/13 50/50/13
f 61/61/14 62/62/14 53/53/14 63/63/14
f 62/62/14 55/55/14 53/53/14
f 63/63/14 53/53/14 54/54/14 64/64/14
f 5/5/15 3/3/15 65/65/15 66/66/15
f 3/3/15 2/2/15 65/65/15
f 66/66/15 65/65/15 56/56/15 58/58/15
f 11/11/16 67/67/16 68/68/16 12/12/16
f 67/67/16 61/61/16 63/63/16 68/68/16
f 68/68/16 63/63/16 64/64/16 69/69/16
f 12/12/16 68/68/16 69/69/16 13/13/16
f 5/5/17 66/66/17 70/70/17 71/71/17
f 66/66/17 58/58/17 70/70/17
f 71/71/17 70/70/17 72/72/17 73/73/17
f 13/13/18 69/69/18 74/74/18 75/75/18
f 69/69/18 64/64/18 76/76/18 74/74/18
f 74/74/18 76/76/18 77/77/18 78/78/18
f 75/75/18 74/74/18 78/78/18 79/79/18
f 73/73/19 80/80/19 81/81/19 71/71/19
f 80/80/19 82/82/19 81/81/19
f 71/71/19 81/81/19 6/6/19 5/5/19
f 15/15/20 14/14/20 83/83/20 84/84/20
f 14/14/20 13/13/20 75/75/20 83/83/20
f 83/83/20 75/75/20 79/79/20 85/85/20
f 84/84/20 83/83/20 85/85/20 86/86/20
f 18/18/21 16/16/21 81/81/21 87/87/21
f 16/16/21 6/6/21 81/81/21
f 87/87/21 81/81/21 82/82/21 88/88/21
f 22/22/22 20/20/22 89/89/22 90/90/22
f 20/20/22 15/15/22 84/84/22 89/89/22
f 89/89/22 84/84/22 86/86/22 91/91/22
f 90/90/22 89/89/22 91/91/22 92/92/22
f 29/29/23 28/28/23 87/87/23 93/93/23
f 28/28/23 18/18/23 87/87/23
f 93/93/23 87/87/23 88/88/23 94/94/23
f 33/33/24 22/22/24 90/90/24 95/95/24
f 95/95/24 90/90/24 92/92/24 96/96/24
f 94/94/25 97/97/25 98/98/25 93/93/25
f 97/97/25 99/99/25 98/98/25
f 93/93/25 98/98/25 36/36/25 29/29/25
f 33/33/26 95/95/26 100/100/26 41/41/26
f 95/95/26 96/96/26 100/100/26
f 41/41/26 100/100/26 101/101/26 42/42/26
f 48/48/27 47/47/27 98/98/27 102/102/27
f 47/47/27 36/36/27 98/98/27
f 102/102/27 98/98/27 99/99/27 103/103/27
f 101/101/28 104/104/28 105/105/28 51/51/28
f 104/104/28 106/106/28 105/105/28
f 101/101/28 51/51/28 42/42/28
f 54/54/29 52/52/29 102/102/29 107/107/29
f 52/52/29 48/48/29 102/102/29
f 107/107/29 102/102/29 103/103/29 108/108/29
f 72/72/30 70/70/30 109/109/30
f 70/70/30 58/58/30 57/110/30 109/109/30
f 60/111/31 59/112/31 105/105/31 110/113/31
f 59/114/31 51/115/31 105/116/31
f 110/117/31 105/118/31 106/106/31
f 108/108/32 111/119/32 76/76/32 107/107/32
f 111/119/32 77/77/32 76/76/32
f 107/107/32 76/76/32 64/64/32 54/54/32
f 99/99/33 97/97/33 112/120/33 113/121/33
f 97/97/33 94/94/33 112/120/33
f 113/121/33 112/120/33 114/122/33 115/123/33
f 101/101/34 100/100/34 116/124/34 117/125/34
f 100/100/34 96/96/34 116/124/34
f 117/125/34 116/124/34 118/126/34 119/127/34
f 115/123/35 120/128/35 121/129/35 113/121/35
f 120/128/35 122/130/35 121/129/35
f 113/121/35 121/129/35 103/103/35 99/99/35
f 106/106/36 104/104/36 117/125/36 119/127/36
f 104/104/36 101/101/36 117/125/36
f 106/106/36 119/127/36 123/131/36
f 122/130/37 124/132/37 125/133/37 121/129/37
f 124/132/37 126/134/37 125/133/37
f 121/129/37 125/133/37 108/108/37 103/103/37
f 57/135/38 127/136/38 109/137/38
f 127/136/38 128/138/38 72/72/38 109/137/38
f 60/139/39 110/140/39 129/141/39
f 110/140/39 106/106/39 123/131/39 129/141/39
f 77/77/40 111/119/40 125/133/40 130/142/40
f 111/119/40 108/108/40 125/133/40
f 130/142/40 125/133/40 126/134/40 131/143/40
f 73/73/41 72/72/41 128/138/41 132/144/41
f 79/79/42 78/78/42 133/145/42 134/146/42
f 78/78/42 77/77/42 130/142/42 133/145/42
f 133/145/42 130/142/42 131/143/42 135/147/42
f 134/146/42 133/145/42 135/147/42 136/148/42
f 137/149/43 138/150/43 80/80/43 139/151/43
f 138/150/43 82/82/43 80/80/43
f 139/151/43 80/80/43 73/73/43 132/144/43
f 86/86/44 85/85/44 140/152/44 141/153/44
f 85/85/44 79/79/44 134/146/44 140/152/44
f 140/152/44 134/146/44 136/148/44 142/154/44
f 141/153/44 140/152/44 142/154/44 143/155/44
f 137/149/45 144/156/45 145/157/45 138/150/45
f 144/156/45 146/158/45 145/157/45
f 138/150/45 145/157/45 88/88/45 82/82/45
f 92/92/46 91/91/46 141/153/46 147/159/46
f 91/91/46 86/86/46 141/153/46
f 147/159/46 141/153/46 143/155/46 148/160/46
f 146/158/47 149/161/47 112/120/47 145/157/47
f 149/161/47 114/122/47 112/120/47
f 145/157/47 112/120/47 94/94/47 88/88/47
f 148/160/48 150/162/48 116/124/48 147/159/48
f 150/162/48 118/126/48 116/124/48
f 147/159/48 116/124/48 96/96/48 92/92/48
f 136/148/49 135/147/49 151/163/49 152/164/49
f 135/147/49 131/143/49 153/165/49 151/163/49
f 151/163/49 153/165/49 154/166/49 155/167/49
f 152/164/49 151/163/49 155/167/49 156/168/49
f 137/149/50 139/151/50 157/169/50 158/170/50
f 139/151/50 132/144/50 157/169/50
f 158/170/50 157/169/50 159/171/50 160/172/50
f 143/155/51 142/154/51 161/173/51 162/174/51
f 142/154/51 136/148/51 152/164/51 161/173/51
f 161/173/51 152/164/51 156/168/51 163/175/51
f 162/174/51 161/173/51 163/175/51 164/176/51
f 146/158/52 144/156/52 158/170/52 165/177/52
f 144/156/52 137/149/52 158/170/52
f 165/177/52 158/170/52 160/172/52 166/178/52
f 164/176/53 167/179/53 168/180/53 162/174/53
f 167/179/53 169/181/53 168/180/53
f 162/174/53 168/180/53 148/160/53 143/155/53
f 114/122/54 149/161/54 170/182/54 171/183/54
f 149/161/54 146/158/54 165/177/54 170/182/54
f 170/182/54 165/177/54 166/178/54 172/184/54
f 171/183/54 170/182/54 172/184/54 173/185/54
f 118/126/55 150/162/55 168/180/55 174/186/55
f 150/162/55 148/160/55 168/180/55
f 174/186/55 168/180/55 169/181/55 175/187/55
f 115/123/56 114/122/56 171/183/56 176/188/56
f 176/188/56 171/183/56 173/185/56 177/189/56
f 118/126/57 174/186/57 178/190/57 179/191/57
f 174/186/57 175/187/57 178/190/57
f 118/126/57 179/191/57 119/127/57
f 122/130/58 120/128/58 180/192/58 181/193/58
f 120/128/58 115/123/58 176/188/58 180/192/58
f 180/192/58 176/188/58 177/189/58 182/194/58
f 181/193/58 180/192/58 182/194/58 183/195/58
f 123/131/59 119/127/59 179/191/59 184/196/59
f 126/134/60 124/132/60 181/193/60 185/197/60
f 124/132/60 122/130/60 181/193/60
f 185/197/60 181/193/60 183/195/60 186/198/60
f 57/199/61 187/200/61 127/201/61
f 187/200/61 188/202/61 128/138/61 127/201/61
f 60/203/62 129/204/62 189/205/62
f 129/204/62 123/131/62 184/196/62 189/205/62
f 186/198/63 190/206/63 153/165/63 185/197/63
f 190/206/63 154/166/63 153/165/63
f 185/197/63 153/165/63 131/143/63 126/134/63
f 188/202/64 191/207/64 157/169/64 132/144/64
f 191/207/64 159/171/64 157/169/64
f 188/202/64 132/144/64 128/138/64
f 179/191/65 178/190/65 192/208/65 193/209/65
f 178/190/65 175/187/65 192/208/65
f 193/209/65 192/208/65 194/210/65 195/211/65
f 183/195/66 182/194/66 196/212/66 197/213/66
f 182/194/66 177/189/66 198/214/66 196/212/66
f 196/212/66 198/214/66 199/215/66 200/216/66
f 197/213/66 196/212/66 200/216/66 201/217/66
f 195/211/67 202/218/67 203/219/67 193/209/67
f 202/218/67 204/220/67 203/219/67
f 193/209/67 203/219/67 184/196/67 179/191/67
f 201/217/68 205/221/68 206/222/68 197/213/68
f 205/221/68 207/223/68 206/222/68
f 197/213/68 206/222/68 186/198/68 183/195/68
f 188/202/69 187/224/69 208/225/69 209/226/69
f 187/227/69 57/228/69 208/229/69
f 209/230/69 208/231/69 210/232/69
f 60/233/70 189/234/70 203/219/70 211/235/70
f 189/236/70 184/237/70 203/238/70
f 211/239/70 203/240/70 204/220/70
f 154/166/71 190/206/71 206/222/71 212/241/71
f 190/206/71 186/198/71 206/222/71
f 212/241/71 206/222/71 207/223/71 213/242/71
f 159/171/72 191/207/72 209/226/72 214/243/72
f 191/207/72 188/202/72 209/226/72
f 214/243/72 209/226/72 210/232/72 215/244/72
f 156/168/73 155/167/73 212/241/73 216/245/73
f 155/167/73 154/166/73 212/241/73
f 216/245/73 212/241/73 213/242/73 217/246/73
f 215/244/74 218/247/74 219/248/74 214/243/74
f 218/247/74 220/249/74 219/248/74
f 214/243/74 219/248/74 160/172/74 159/171/74
f 164/176/75 163/175/75 221/250/75 222/251/75
f 163/175/75 156/168/75 216/245/75 221/250/75
f 221/250/75 216/245/75 217/246/75 223/252/75
f 222/251/75 221/250/75 223/252/75 224/253/75
f 166/178/76 160/172/76 219/248/76 225/254/76
f 225/254/76 219/248/76 220/249/76 226/255/76
f 169/181/77 167/179/77 227/256/77 228/257/77
f 167/179/77 164/176/77 222/251/77 227/256/77
f 227/256/77 222/251/77 224/253/77 229/258/77
f 228/257/77 227/256/77 229/258/77 230/259/77
f 173/185/78 172/184/78 225/254/78 231/260/78
f 172/184/78 166/178/78 225/254/78
f 231/260/78 225/254/78 226/255/78 232/261/78
f 175/187/79 169/181/79 228/257/79 192/208/79
f 192/208/79 228/257/79 230/259/79 194/210/79
f 232/261/80 233/262/80 198/214/80 231/260/80
f 233/262/80 199/215/80 198/214/80
f 231/260/80 198/214/80 177/189/80 173/185/80
f 234/263/81 235/264/81 218/247/81 236/265/81
f 235/264/81 220/249/81 218/247/81
f 236/265/81 218/247/81 215/244/81 237/266/81
f 224/253/82 223/252/82 238/267/82 239/268/82
f 223/252/82 217/246/82 238/267/82
f 239/268/82 238/267/82 240/269/82 241/270/82
f 226/255/83 220/249/83 235/264/83 242/271/83
f 242/271/83 235/264/83 234/263/83 243/272/83
f 230/259/84 229/258/84 239/268/84 244/273/84
f 229/258/84 224/253/84 239/268/84
f 244/273/84 239/268/84 241/270/84 245/274/84
f 243/272/85 246/275/85 247/276/85 242/271/85
f 246/275/85 248/277/85 247/276/85
f 242/271/85 247/276/85 232/261/85 226/255/85
f 230/259/86 244/273/86 249/278/86 250/279/86
f 244/273/86 245/274/86 249/278/86
f 230/259/86 250/279/86 194/210/86
f 199/215/87 233/262/87 247/276/87 248/277/87
f 233/262/87 232/261/87 247/276/87
f 199/215/87 248/277/87 251/280/87
f 195/211/88 194/210/88 250/279/88 252/281/88
f 253/282/89 254/283/89 200/216/89 255/284/89
f 254/283/89 201/217/89 200/216/89
f 255/284/89 200/216/89 199/215/89 251/280/89
f 195/211/90 252/281/90 256/285/90 202/218/90
f 202/218/90 256/285/90 257/286/90 204/220/90
f 207/223/91 205/221/91 258/287/91 259/288/91
f 205/221/91 201/217/91 254/283/91 258/287/91
f 258/287/91 254/283/91 253/282/91 260/289/91
f 259/288/91 258/287/91 260/289/91 261/290/91
f 57/291/92 262/292/92 208/293/92
f 262/292/92 263/294/92 210/232/92 208/293/92
f 60/295/93 211/296/93 264/297/93
f 211/296/93 204/220/93 257/286/93 264/297/93
f 213/242/94 207/223/94 259/288/94 265/298/94
f 265/298/94 259/288/94 261/290/94 266/299/94
f 215/244/95 210/232/95 263/294/95 237/266/95
f 266/299/96 267/300/96 238/267/96 265/298/96
f 267/300/96 240/269/96 238/267/96
f 265/298/96 238/267/96 217/246/96 213/242/96
f 253/282/97 255/284/97 268/301/97 269/302/97
f 255/284/97 251/280/97 270/303/97 268/301/97
f 268/301/97 270/303/97 271/304/97 272/305/97
f 269/302/97 268/301/97 272/305/97 273/306/97
f 257/286/98 256/285/98 274/307/98 275/308/98
f 256/285/98 252/281/98 274/307/98
f 257/286/98 275/308/98 276/309/98
f 261/290/99 260/289/99 269/302/99 277/310/99
f 260/289/99 253/282/99 269/302/99
f 277/310/99 269/302/99 273/306/99 278/311/99
f 57/312/100 279/313/100 262/314/100
f 279/313/100 280/315/100 263/294/100 262/314/100
f 60/316/101 264/317/101 281/318/101
f 264/317/101 257/286/101 276/309/101 281/318/101
f 278/311/102 282/319/102 283/320/102 277/310/102
f 282/319/102 284/321/102 283/320/102
f 277/310/102 283/320/102 266/299/102 261/290/102
f 280/315/103 285/322/103 286/323/103 237/266/103
f 285/322/103 287/324/103 286/323/103
f 280/315/103 237/266/103 263/294/103
f 240/269/104 267/300/104 283/320/104 288/325/104
f 267/300/104 266/299/104 283/320/104
f 288/325/104 283/320/104 284/321/104 289/326/104
f 234/263/105 236/265/105 286/323/105 290/327/105
f 236/265/105 237/266/105 286/323/105
f 290/327/105 286/323/105 287/324/105 291/328/105
f 289/326/106 292/329/106 293/330/106 288/325/106
f 292/329/106 294/331/106 293/330/106
f 288/325/106 293/330/106 241/270/106 240/269/106
f 234/263/107 290/327/107 295/332/107 296/333/107
f 290/327/107 291/328/107 295/332/107
f 234/263/107 296/333/107 243/272/107
f 245/274/108 241/270/108 293/330/108 297/334/108
f 297/334/108 293/330/108 294/331/108 298/335/108
f 299/336/109 300/337/109 246/275/109 301/338/109
f 300/337/109 248/277/109 246/275/109
f 301/338/109 246/275/109 243/272/109 296/333/109
f 250/279/110 249/278/110 302/339/110 303/340/110
f 249/278/110 245/274/110 297/334/110 302/339/110
f 302/339/110 297/334/110 298/335/110 304/341/110
f 303/340/110 302/339/110 304/341/110 305/342/110
f 251/280/111 248/277/111 300/337/111 270/303/111
f 270/303/111 300/337/111 299/336/111 271/304/111
f 305/342/112 306/343/112 274/307/112 303/340/112
f 306/343/112 275/308/112 274/307/112
f 303/340/112 274/307/112 252/281/112 250/279/112
f 294/331/113 292/329/113 307/344/113 308/345/113
f 292/329/113 289/326/113 307/344/113
f 308/345/113 307/344/113 309/346/113 310/347/113
f 296/333/114 295/332/114 311/348/114 312/349/114
f 295/332/114 291/328/114 313/350/114 311/348/114
f 311/348/114 313/350/114 314/351/114 315/352/114
f 312/349/114 311/348/114 315/352/114 316/353/114
f 310/347/115 317/354/115 318/355/115 308/345/115
f 317/354/115 319/356/115 318/355/115
f 308/345/115 318/355/115 298/335/115 294/331/115
f 299/336/116 301/338/116 320/357/116 321/358/116
f 301/338/116 296/333/116 312/349/116 320/357/116
f 320/357/116 312/349/116 316/353/116 322/359/116
f 321/358/116 320/357/116 322/359/116 323/360/116
f 305/342/117 304/341/117 318/355/117 324/361/117
f 304/341/117 298/335/117 318/355/117
f 324/361/117 318/355/117 319/356/117 325/362/117
f 271/304/118 299/336/118 321/358/118 326/363/118
f 326/363/118 321/358/118 323/360/118 327/364/118
f 275/308/119 306/343/119 324/361/119 328/365/119
f 306/343/119 305/342/119 324/361/119
f 328/365/119 324/361/119 325/362/119 329/366/119
f 273/306/120 272/305/120 326/363/120 330/367/120
f 272/305/120 271/304/120 326/363/120
f 330/367/120 326/363/120 327/364/120 331/368/120
f 275/308/121 328/365/121 332/369/121 333/370/121
f 328/365/121 329/366/121 332/369/121
f 275/308/121 333/370/121 276/309/121
f 331/368/122 334/371/122 335/372/122 330/367/122
f 334/371/122 336/373/122 335/372/122
f 330/367/122 335/372/122 278/311/122 273/306/122
f 280/315/123 279/374/123 337/375/123
f 279/374/123 57/376/123 338/377/123 337/375/123
f 60/378/124 281/379/124 339/380/124
f 281/379/124 276/309/124 333/370/124 339/380/124
f 284/321/125 282/319/125 340/381/125 341/382/125
f 282/319/125 278/311/125 335/372/125 340/381/125
f 340/381/125 335/372/125 336/373/125 342/383/125
f 341/382/125 340/381/125 342/383/125 343/384/125
f 287/324/126 285/322/126 344/385/126 345/386/126
f 285/322/126 280/315/126 337/375/126 344/385/126
f 344/385/126 337/375/126 338/377/126 346/387/126
f 345/386/126 344/385/126 346/387/126 347/388/126
f 289/326/127 284/321/127 341/382/127 307/344/127
f 307/344/127 341/382/127 343/384/127 309/346/127
f 291/328/128 287/324/128 345/386/128 313/350/128
f 313/350/128 345/386/128 347/388/128 314/351/128
f 329/366/129 348/389/129 349/390/129 332/369/129
f 332/369/129 349/390/129 350/391/129 333/370/129
f 336/373/130 334/371/130 351/392/130 352/393/130
f 334/371/130 331/368/130 353/394/130 351/392/130
f 351/392/130 353/394/130 354/395/130 355/396/130
f 352/393/130 351/392/130 355/396/130 356/397/130
f 338/377/131 57/398/131 357/399/131
f 60/400/132 339/401/132 358/402/132
f 339/401/132 333/370/132 350/391/132 358/402/132
f 343/384/133 342/383/133 359/403/133 360/404/133
f 342/383/133 336/373/133 352/393/133 359/403/133
f 359/403/133 352/393/133 356/397/133 361/405/133
f 360/404/133 359/403/133 361/405/133 362/406/133
f 363/407/134 364/408/134 346/387/134 365/409/134
f 364/408/134 347/388/134 346/387/134
f 365/409/134 346/387/134 338/377/134 357/399/134
f 362/406/135 366/410/135 367/411/135 360/404/135
f 366/410/135 368/412/135 367/411/135
f 360/404/135 367/411/135 309/346/135 343/384/135
f 314/351/136 347/388/136 364/408/136 369/413/136
f 369/413/136 364/408/136 363/407/136 370/414/136
f 310/347/137 309/346/137 367/411/137 371/415/137
f 371/415/137 367/411/137 368/412/137 372/416/137
f 316/353/138 315/352/138 369/413/138 373/417/138
f 315/352/138 314/351/138 369/413/138
f 373/417/138 369/413/138 370/414/138 374/418/138
f 319/356/139 317/354/139 375/419/139 376/420/139
f 317/354/139 310/347/139 371/415/139 375/419/139
f 375/419/139 371/415/139 372/416/139 377/421/139
f 376/420/139 375/419/139 377/421/139 378/422/139
f 316/353/140 373/417/140 379/423/140 322/359/140
f 373/417/140 374/418/140 379/423/140
f 322/359/140 379/423/140 380/424/140 323/360/140
f 319/356/141 376/420/141 381/425/141 382/426/141
f 376/420/141 378/422/141 381/425/141
f 319/356/141 382/426/141 325/362/141
f 380/424/142 383/427/142 384/428/142 327/364/142
f 383/427/142 385/429/142 384/428/142
f 380/424/142 327/364/142 323/360/142
f 329/366/143 325/362/143 382/426/143 348/389/143
f 331/368/144 327/364/144 384/428/144 353/394/144
f 353/394/144 384/428/144 385/429/144 354/395/144
f 378/430/145 377/431/145 386/432/145 387/433/145
f 377/431/145 372/434/145 388/435/145 386/432/145
f 386/432/145 388/435/145 389/436/145 390/437/145
f 387/433/145 386/432/145 390/437/145 391/438/145
f 380/439/146 379/440/146 392/441/146 393/442/146
f 379/440/146 374/443/146 394/444/146 392/441/146
f 392/441/146 394/444/146 395/445/146 396/446/146
f 393/442/146 392/441/146 396/446/146 397/447/146
f 382/448/147 381/449/147 387/433/147 398/450/147
f 381/449/147 378/430/147 387/433/147
f 398/450/147 387/433/147 391/438/147 399/451/147
f 385/452/148 383/453/148 393/442/148 400/454/148
f 383/453/148 380/439/148 393/442/148
f 400/454/148 393/442/148 397/447/148 401/455/148
f 348/456/149 382/448/149 398/450/149 402/457/149
f 402/457/149 398/450/149 399/451/149 403/458/149
f 401/455/150 404/459/150 405/460/150 400/454/150
f 404/459/150 406/461/150 405/460/150
f 400/454/150 405/460/150 354/462/150 385/452/150
f 350/463/151 349/464/151 402/457/151 407/465/151
f 349/464/151 348/456/151 402/457/151
f 407/465/151 402/457/151 403/458/151 408/466/151
f 356/467/152 355/468/152 405/460/152 409/469/152
f 355/468/152 354/462/152 405/460/152
f 409/469/152 405/460/152 406/461/152 410/470/152
f 357/471/153 57/472/153 411/473/153
f 350/463/154 407/465/154 358/474/154
f 407/465/154 408/466/154 60/475/154 358/474/154
f 362/476/155 361/477/155 409/469/155 412/478/155
f 361/477/155 356/467/155 409/469/155
f 412/478/155 409/469/155 410/470/155 413/479/155
f 357/471/156 411/473/156 414/480/156 365/481/156
f 365/481/156 414/480/156 415/482/156 363/483/156
f 368/484/157 366/485/157 416/486/157 417/487/157
f 366/485/157 362/476/157 412/478/157 416/486/157
f 416/486/157 412/478/157 413/479/157 418/488/157
f 417/487/157 416/486/157 418/488/157 419/489/157
f 415/482/158 420/490/158 421/491/158 370/492/158
f 420/490/158 422/493/158 421/491/158
f 415/482/158 370/492/158 363/483/158
f 372/434/159 368/484/159 417/487/159 388/435/159
f 388/435/159 417/487/159 419/489/159 389/436/159
f 374/443/160 370/492/160 421/491/160 394/444/160
f 394/444/160 421/491/160 422/493/160 395/445/160
f 411/473/161 57/494/161 423/495/161
f 60/496/162 408/466/162 424/497/162
f 425/498/163 426/499/163 427/500/163 428/501/163
f 426/499/163 429/502/163 427/500/163
f 428/501/163 427/500/163 413/479/163 410/470/163
f 430/503/164 431/504/164 414/480/164 432/505/164
f 431/504/164 415/482/164 414/480/164
f 432/505/164 414/480/164 411/473/164 423/495/164
f 419/489/165 418/488/165 433/506/165 434/507/165
f 418/488/165 413/479/165 427/500/165 433/506/165
f 433/506/165 427/500/165 429/502/165 435/508/165
f 434/507/165 433/506/165 435/508/165 436/509/165
f 422/493/166 420/490/166 431/504/166 437/510/166
f 420/490/166 415/482/166 431/504/166
f 437/510/166 431/504/166 430/503/166 438/511/166
f 436/509/167 439/512/167 440/513/167 434/507/167
f 439/512/167 441/514/167 440/513/167
f 434/507/167 440/513/167 389/436/167 419/489/167
f 395/445/168 422/493/168 437/510/168 442/515/168
f 442/515/168 437/510/168 438/511/168 443/516/168
f 391/438/169 390/437/169 440/513/169 444/517/169
f 390/437/169 389/436/169 440/513/169
f 444/517/169 440/513/169 441/514/169 445/518/169
f 397/447/170 396/446/170 446/519/170 447/520/170
f 396/446/170 395/445/170 442/515/170 446/519/170
f 446/519/170 442/515/170 443/516/170 448/521/170
f 447/520/170 446/519/170 448/521/170 449/522/170
f 445/518/171 450/523/171 451/524/171 444/517/171
f 450/523/171 452/525/171 451/524/171
f 444/517/171 451/524/171 399/451/171 391/438/171
f 401/455/172 397/447/172 447/520/172 453/526/172
f 453/526/172 447/520/172 449/522/172 454/527/172
f 399/451/173 451/524/173 455/528/173 456/529/173
f 451/524/173 452/525/173 455/528/173
f 399/451/173 456/529/173 403/458/173
f 406/461/174 404/459/174 457/530/174 458/531/174
f 404/459/174 401/455/174 453/526/174 457/530/174
f 457/530/174 453/526/174 454/527/174 459/532/174
f 458/531/174 457/530/174 459/532/174 460/533/174
f 408/466/175 403/458/175 456/529/175 424/497/175
f 410/470/176 406/461/176 458/531/176 428/501/176
f 428/501/176 458/531/176 460/533/176 425/498/176
f 443/516/177 19/19/177 25/25/177 448/521/177
f 448/521/177 25/25/177 24/24/177 449/522/177
f 445/518/178 23/23/178 31/31/178 450/523/178
f 450/523/178 31/31/178 30/30/178 452/525/178
f 454/527/179 449/522/179 24/24/179 34/34/179
f 452/525/180 30/30/180 38/38/180 455/528/180
f 455/528/180 38/38/180 37/37/180 456/529/180
f 454/527/181 34/34/181 44/44/181 459/532/181
f 459/532/181 44/44/181 43/43/181 460/533/181
f 424/497/182 456/529/182 37/37/182 49/49/182
f 425/498/183 460/533/183 43/43/183 55/55/183
f 423/495/184 57/534/184 56/56/184
f 60/535/185 424/497/185 49/49/185
f 425/498/186 55/55/186 62/62/186 426/499/186
f 426/499/186 62/62/186 61/61/186 429/502/186
f 2/2/187 430/503/187 432/505/187 65/65/187
f 65/65/187 432/505/187 423/495/187 56/56/187
f 429/502/188 61/61/188 67/67/188 435/508/188
f 435/508/188 67/67/188 11/11/188 436/509/188
f 2/2/189 1/1/189 438/511/189 430/503/189
f 436/509/190 11/11/190 8/8/190 439/512/190
f 439/512/190 8/8/190 7/7/190 441/514/190
f 1/1/191 19/19/191 443/516/191 438/511/191
f 445/518/192 441/514/192 7/7/192 23/23/192
o Sphere.001
v 0.117054 1.176942 -0.202744
v 0.202744 1.176942 -0.117054
v 0.300220 1.142799 -0.173332
v 0.173332 1.142799 -0.300220
v 0.397697 1.108655 -0.229610
v 0.229610 1.108655 -0.397696
v 0.588471 -0.234108 -1.019262
v 1.019262 -0.234108 -0.588471
v 0.989693 -0.346664 -0.571399
v 0.571400 -0.346664 -0.989693
v 0.960124 -0.459220 -0.554328
v 0.554328 -0.459220 -0.960124
v 0.487531 1.053210 -0.281476
v 0.281476 1.053210 -0.487531
v 0.577366 0.997764 -0.333342
v 0.333342 0.997764 -0.577366
v 0.498882 -0.666684 -0.864089
v 0.864089 -0.666684 -0.498882
v 0.424264 0.848528 -0.734847
v 0.734847 0.848528 -0.424264
v 0.799468 -0.757606 -0.461573
v 0.461573 -0.757606 -0.799468
v 0.734847 -0.848528 -0.424264
v 0.424264 -0.848528 -0.734847
v 0.799468 0.757606 -0.461573
v 0.461573 0.757606 -0.799468
v 0.864089 0.666684 -0.498882
v 0.498882 0.666684 -0.864089
v 0.333342 -0.997764 -0.577365
v 0.577366 -0.997764 -0.333342
v 0.912107 0.562952 -0.526605
v 0.526605 0.562952 -0.912106
v 0.960124 0.459220 -0.554328
v 0.554328 0.459220 -0.960124
v 0.487531 -1.053210 -0.281476
v 0.281476 -1.053210 -0.487531
v 0.397696 -1.108656 -0.229610
v 0.229610 -1.108656 -0.397696
v 0.588471 0.234108 -1.019262
v 1.019262 0.234108 -0.588471
v 0.300220 -1.142799 -0.173332
v 0.173332 -1.142799 -0.300220
v 0.202744 -1.176942 -0.117054
v 0.117054 -1.176942 -0.202744
v 1.029247 0.117054 -0.594235
v 0.594236 0.117054 -1.029246
v 1.039231 0.000000 -0.600000
v 0.600000 0.000000 -1.039230
v -0.000000 1.200000 0.000001
v 0.101372 1.188471 -0.058527
v 0.058527 1.188471 -0.101372
v 0.000000 -1.200000 0.000000
v 0.058527 -1.188471 -0.101372
v 0.101372 -1.188471 -0.058527
v 1.176943 -0.234108 0.000000
v 1.019262 -0.234108 0.588472
v 0.989693 -0.346664 0.571400
v 1.142799 -0.346664 0.000000
v 0.960124 -0.459220 0.554328
v 1.108656 -0.459220 0.000000
v 0.459221 1.108655 0.000000
v 0.397697 1.108655 0.229611
v 0.487531 1.053210 0.281477
v 0.562953 1.053210 0.000000
v 0.577366 0.997764 0.333343
v 0.666685 0.997764 0.000000
v 0.997764 -0.666684 0.000000
v 0.864089 -0.666684 0.498882
v 0.848529 0.848528 0.000000
v 0.734847 0.848528 0.424265
v 0.799468 -0.757606 0.461574
v 0.923146 -0.757606 0.000000
v 0.734847 -0.848528 0.424265
v 0.848529 -0.848528 0.000000
v 0.799468 0.757606 0.461574
v 0.923146 0.757606 0.000000
v 0.864089 0.666684 0.498882
v 0.997764 0.666684 0.000000
v 0.656107 -0.923146 0.378804
v 0.757607 -0.923146 0.000000
v 0.577366 -0.997764 0.333343
v 0.666685 -0.997764 0.000000
v 1.108656 0.459220 0.000000
v 0.960124 0.459220 0.554328
v 0.459220 -1.108656 0.000000
v 0.397696 -1.108656 0.229611
v 0.989693 0.346664 0.571400
v 1.142799 0.346664 0.000000
v 1.019262 0.234108 0.588472
v 1.176943 0.234108 0.000000
v 0.300220 -1.142799 0.173333
v 0.346664 -1.142799 0.000000
v 0.202744 -1.176942 0.117055
v 0.234109 -1.176942 0.000000
v 1.029246 0.117054 0.594236
v 1.188472 0.117054 0.000000
v 1.039231 0.000000 0.600001
v 1.200000 0.000000 0.000000
v 0.101372 1.188471 0.058528
v 0.117054 1.188471 0.000000
v 0.202744 1.176942 0.117055
v 0.234109 1.176942 0.000000
v 0.117054 -1.188471 0.000000
v 0.101372 -1.188471 0.058528
v 0.229610 1.108655 0.397697
v 0.000000 1.108655 0.459221
v 0.000000 1.053210 0.562953
v 0.281476 1.053210 0.487532
v 0.000000 0.997764 0.666685
v 0.333342 0.997764 0.577366
v 0.554328 -0.459220 0.960125
v -0.000000 -0.459220 1.108656
v -0.000000 -0.562952 1.053210
v 0.526605 -0.562952 0.912107
v -0.000000 -0.666684 0.997764
v 0.498882 -0.666684 0.864089
v -0.000000 0.923146 0.757607
v 0.378803 0.923146 0.656107
v -0.000000 0.848528 0.848529
v 0.424264 0.848528 0.734848
v -0.000000 -0.757606 0.923147
v 0.461573 -0.757606 0.799469
v -0.000000 -0.848528 0.848529
v 0.424264 -0.848528 0.734848
v -0.000000 0.757606 0.923147
v 0.461573 0.757606 0.799469
v -0.000000 0.666684 0.997764
v 0.498882 0.666684 0.864089
v -0.000000 -0.923146 0.757607
v 0.378803 -0.923146 0.656107
v -0.000000 -0.997764 0.666685
v 0.333342 -0.997764 0.577366
v 0.554328 0.459220 0.960124
v -0.000000 0.459220 1.108656
v -0.000000 -1.053210 0.562953
v 0.281476 -1.053210 0.487531
v -0.000000 -1.108656 0.459221
v 0.229610 -1.108656 0.397697
v -0.000000 0.346664 1.142800
v 0.571400 0.346664 0.989694
v -0.000000 0.234108 1.176943
v 0.588471 0.234108 1.019263
v 0.117054 -1.176942 0.202744
v -0.000000 -1.176942 0.234109
v 0.600000 0.000000 1.039231
v -0.000000 0.000000 1.200001
v -0.000000 1.188471 0.117055
v 0.058527 1.188471 0.101373
v -0.000000 1.176942 0.234109
v 0.117054 1.176942 0.202745
v 0.058527 -1.188471 0.101372
v -0.000000 -1.188471 0.117055
v -0.000000 -0.117054 1.188472
v 0.594236 -0.117054 1.029247
v -0.000000 -0.234108 1.176943
v 0.588471 -0.234108 1.019263
v -0.554328 -0.459220 0.960125
v -0.960124 -0.459220 0.554328
v -0.912107 -0.562952 0.526605
v -0.526605 -0.562952 0.912107
v -0.864089 -0.666684 0.498882
v -0.498882 -0.666684 0.864089
v -0.333342 0.997764 0.577366
v -0.577366 0.997764 0.333343
v -0.656107 0.923146 0.378804
v -0.378803 0.923146 0.656107
v -0.734847 0.848528 0.424265
v -0.424264 0.848528 0.734848
v -0.424264 -0.848528 0.734848
v -0.734847 -0.848528 0.424265
v -0.799468 0.757606 0.461573
v -0.461573 0.757606 0.799468
v -0.864089 0.666684 0.498882
v -0.498882 0.666684 0.864089
v -0.333342 -0.997764 0.577366
v -0.577366 -0.997764 0.333343
v -0.912107 0.562952 0.526605
v -0.526605 0.562952 0.912107
v -0.960124 0.459220 0.554328
v -0.554328 0.459220 0.960124
v -0.487531 -1.053210 0.281477
v -0.281476 -1.053210 0.487531
v -0.397696 -1.108656 0.229611
v -0.229610 -1.108656 0.397697
v -0.588471 0.234108 1.019263
v -1.019262 0.234108 0.588472
v -0.300220 -1.142799 0.173333
v -0.173332 -1.142799 0.300221
v -0.202744 -1.176942 0.117055
v -0.117054 -1.176942 0.202744
v -0.600000 0.000000 1.039231
v -1.039231 0.000000 0.600000
v -0.101372 1.188471 0.058528
v -0.058527 1.188471 0.101373
v -0.202744 1.176942 0.117055
v -0.117054 1.176942 0.202745
v -0.058527 -1.188471 0.101372
v -0.101372 -1.188471 0.058528
v -1.029246 -0.117054 0.594236
v -0.594236 -0.117054 1.029247
v -1.019262 -0.234108 0.588472
v -0.588471 -0.234108 1.019263
v -0.229610 1.108655 0.397697
v -0.397697 1.108655 0.229611
v -0.997764 -0.666684 0.000000
v -0.864089 -0.666684 -0.498882
v -0.799468 -0.757606 -0.461573
v -0.923146 -0.757606 0.000000
v -0.734847 -0.848528 -0.424264
v -0.848528 -0.848528 0.000000
v -0.848528 0.848528 0.000000
v -0.734847 0.848528 -0.424264
v -0.799468 0.757606 -0.461573
v -0.923146 0.757606 0.000000
v -0.864089 0.666684 -0.498882
v -0.997764 0.666684 0.000000
v -0.656106 -0.923146 -0.378803
v -0.757607 -0.923146 0.000000
v -0.577366 -0.997764 -0.333342
v -0.666685 -0.997764 0.000000
v -0.912106 0.562952 -0.526605
v -1.053210 0.562952 0.000000
v -0.960124 0.459220 -0.554327
v -1.108656 0.459220 0.000000
v -0.487531 -1.053210 -0.281476
v -0.562952 -1.053210 0.000000
v -0.397696 -1.108656 -0.229610
v -0.459220 -1.108656 0.000000
v -0.989693 0.346664 -0.571399
v -1.142799 0.346664 0.000000
v -1.019262 0.234108 -0.588471
v -1.176943 0.234108 0.000000
v -0.234109 -1.176942 0.000000
v -0.202744 -1.176942 -0.117054
v -1.029246 0.117054 -0.594235
v -1.188471 0.117054 0.000000
v -1.039231 0.000000 -0.600000
v -1.200000 0.000000 0.000000
v -0.234109 1.176942 0.000000
v -0.202744 1.176942 -0.117054
v -0.117054 -1.188471 0.000000
v -0.101372 -1.188471 -0.058527
v -1.029246 -0.117054 -0.594235
v -1.188471 -0.117054 0.000000
v -1.019262 -0.234108 -0.588471
v -1.176943 -0.234108 0.000000
v -0.300220 1.142799 -0.173332
v -0.346665 1.142799 0.000000
v -0.397697 1.108655 -0.229610
v -0.459220 1.108655 0.000000
v -0.989693 -0.346664 -0.571399
v -1.142799 -0.346664 0.000000
v -0.960124 -0.459220 -0.554328
v -1.108656 -0.459220 0.000000
v -0.666685 0.997764 0.000000
v -0.577366 0.997764 -0.333342
v -0.424264 0.848528 -0.734847
v 0.000000 0.848528 -0.848528
v 0.000000 0.757606 -0.923146
v -0.461573 0.757606 -0.799468
v 0.000000 0.666684 -0.997764
v -0.498882 0.666684 -0.864089
v -0.424264 -0.848528 -0.734847
v 0.000000 -0.848528 -0.848528
v 0.000000 -0.923146 -0.757606
v -0.378803 -0.923146 -0.656106
v 0.000000 -0.997764 -0.666684
v -0.333342 -0.997764 -0.577365
v 0.000000 0.562952 -1.053210
v -0.526605 0.562952 -0.912106
v 0.000000 0.459220 -1.108655
v -0.554328 0.459220 -0.960124
v 0.000000 -1.053210 -0.562952
v -0.281476 -1.053210 -0.487531
v 0.000000 -1.108656 -0.459220
v -0.229610 -1.108656 -0.397696
v -0.588471 0.234108 -1.019262
v 0.000000 0.234108 -1.176942
v -0.117054 -1.176942 -0.202744
v -0.000000 -1.176942 -0.234108
v 0.000000 0.117054 -1.188471
v -0.594236 0.117054 -1.029246
v 0.000000 0.000000 -1.200000
v -0.600000 0.000000 -1.039230
v -0.117054 1.176942 -0.202744
v -0.000000 1.176942 -0.234108
v 0.000000 -0.117054 -1.188471
v -0.594236 -0.117054 -1.029246
v 0.000000 -0.234108 -1.176942
v -0.588471 -0.234108 -1.019262
v 0.000000 1.108655 -0.459220
v -0.229610 1.108655 -0.397696
v -0.173332 1.142799 -0.300220
v -0.000000 1.142799 -0.346664
v -0.000000 -0.346664 -1.142799
v -0.571400 -0.346664 -0.989693
v -0.000000 -0.459220 -1.108655
v -0.554328 -0.459220 -0.960124
v 0.000000 0.997764 -0.666684
v -0.333342 0.997764 -0.577365
v -0.281476 1.053210 -0.487531
v 0.000000 1.053210 -0.562952
v -0.000000 -0.562952 -1.053210
v -0.526605 -0.562952 -0.912106
v 0.000000 -0.666684 -0.997764
v -0.498882 -0.666684 -0.864089
vt 0.666667 0.937500
vt 0.583333 0.937500
vt 0.583333 0.906250
vt 0.666667 0.906250
vt 0.583333 0.875000
vt 0.666667 0.875000
vt 0.666667 0.437500
vt 0.583333 0.437500
vt 0.583333 0.406250
vt 0.666667 0.406250
vt 0.583333 0.375000
vt 0.666667 0.375000
vt 0.583333 0.843750
vt 0.666667 0.843750
vt 0.583333 0.812500
vt 0.666667 0.812500
vt 0.666667 0.312500
vt 0.583333 0.312500
vt 0.666667 0.750000
vt 0.583333 0.750000
vt 0.583333 0.281250
vt 0.666667 0.281250
vt 0.583333 0.250000
vt 0.666667 0.250000
vt 0.583333 0.718750
vt 0.666667 0.718750
vt 0.583333 0.687500
vt 0.666667 0.687500
vt 0.666667 0.187500
vt 0.583333 0.187500
vt 0.583333 0.656250
vt 0.666667 0.656250
vt 0.583333 0.625000
vt 0.666667 0.625000
vt 0.583333 0.156250
vt 0.666667 0.156250
vt 0.583333 0.125000
vt 0.666667 0.125000
vt 0.666667 0.562500
vt 0.583333 0.562500
vt 0.583333 0.093750
vt 0.666667 0.093750
vt 0.583333 0.062500
vt 0.666667 0.062500
vt 0.583333 0.531250
vt 0.666667 0.531250
vt 0.583333 0.500000
vt 0.666667 0.500000
vt 0.625000 1.000000
vt 0.604166 0.968750
vt 0.645833 0.968750
vt 0.625000 0.000000
vt 0.645833 0.031250
vt 0.604166 0.031250
vt 0.500000 0.437500
vt 0.416667 0.437500
vt 0.416667 0.406250
vt 0.500000 0.406250
vt 0.416667 0.375000
vt 0.500000 0.375000
vt 0.500000 0.875000
vt 0.416667 0.875000
vt 0.416667 0.843750
vt 0.500000 0.843750
vt 0.416667 0.812500
vt 0.500000 0.812500
vt 0.500000 0.312500
vt 0.416667 0.312500
vt 0.500000 0.750000
vt 0.416667 0.750000
vt 0.416667 0.281250
vt 0.500000 0.281250
vt 0.416667 0.250000
vt 0.500000 0.250000
vt 0.416667 0.718750
vt 0.500000 0.718750
vt 0.416667 0.687500
vt 0.500000 0.687500
vt 0.416667 0.218750
vt 0.500000 0.218750
vt 0.416667 0.187500
vt 0.500000 0.187500
vt 0.500000 0.625000
vt 0.416667 0.625000
vt 0.500000 0.125000
vt 0.416667 0.125000
vt 0.416667 0.593750
vt 0.500000 0.593750
vt 0.416667 0.562500
vt 0.500000 0.562500
vt 0.416666 0.093750
vt 0.500000 0.093750
vt 0.416666 0.062500
vt 0.500000 0.062500
vt 0.416667 0.531250
vt 0.500000 0.531250
vt 0.416667 0.500000
vt 0.500000 0.500000
vt 0.458333 1.000000
vt 0.437500 0.968750
vt 0.479166 0.968750
vt 0.416666 0.937500
vt 0.500000 0.937500
vt 0.458333 0.000000
vt 0.479166 0.031250
vt 0.437500 0.031250
vt 0.333333 0.875000
vt 0.250000 0.875000
vt 0.250000 0.843750
vt 0.333333 0.843750
vt 0.250000 0.812500
vt 0.333333 0.812500
vt 0.333333 0.375000
vt 0.250000 0.375000
vt 0.250000 0.343750
vt 0.333333 0.343750
vt 0.250000 0.312500
vt 0.333333 0.312500
vt 0.250000 0.781250
vt 0.333333 0.781250
vt 0.250000 0.750000
vt 0.333333 0.750000
vt 0.250000 0.281250
vt 0.333333 0.281250
vt 0.250000 0.250000
vt 0.333333 0.250000
vt 0.250000 0.718750
vt 0.333333 0.718750
vt 0.250000 0.687500
vt 0.333333 0.687500
vt 0.250000 0.218750
vt 0.333333 0.218750
vt 0.250000 0.187500
vt 0.333333 0.187500
vt 0.333333 0.625000
vt 0.250000 0.625000
vt 0.250000 0.156250
vt 0.333333 0.156250
vt 0.250000 0.125000
vt 0.333333 0.125000
vt 0.250000 0.593750
vt 0.333333 0.593750
vt 0.250000 0.562500
vt 0.333333 0.562500
vt 0.333333 0.062500
vt 0.250000 0.062500
vt 0.333333 0.500000
vt 0.250000 0.500000
vt 0.291666 1.000000
vt 0.270833 0.968750
vt 0.312500 0.968750
vt 0.250000 0.937500
vt 0.333333 0.937500
vt 0.291667 0.000000
vt 0.312500 0.031250
vt 0.270833 0.031250
vt 0.250000 0.468750
vt 0.333333 0.468750
vt 0.250000 0.437500
vt 0.333333 0.437500
vt 0.166667 0.375000
vt 0.083333 0.375000
vt 0.083333 0.343750
vt 0.166667 0.343750
vt 0.083333 0.312500
vt 0.166667 0.312500
vt 0.166667 0.812500
vt 0.083333 0.812500
vt 0.083333 0.781250
vt 0.166667 0.781250
vt 0.083333 0.750000
vt 0.166667 0.750000
vt 0.166667 0.250000
vt 0.083333 0.250000
vt 0.083333 0.718750
vt 0.166667 0.718750
vt 0.083333 0.687500
vt 0.166667 0.687500
vt 0.166667 0.187500
vt 0.083333 0.187500
vt 0.083333 0.656250
vt 0.166667 0.656250
vt 0.083333 0.625000
vt 0.166667 0.625000
vt 0.083333 0.156250
vt 0.166667 0.156250
vt 0.083333 0.125000
vt 0.166667 0.125000
vt 0.166667 0.562500
vt 0.083333 0.562500
vt 0.083333 0.093750
vt 0.166667 0.093750
vt 0.083334 0.062500
vt 0.166667 0.062500
vt 0.166667 0.500000
vt 0.083333 0.500000
vt 0.125000 1.000000
vt 0.104167 0.968750
vt 0.145834 0.968750
vt 0.083334 0.937500
vt 0.166667 0.937500
vt 0.125000 0.000000
vt 0.145834 0.031250
vt 0.104167 0.031250
vt 0.083333 0.468750
vt 0.166667 0.468750
vt 0.083333 0.437500
vt 0.166667 0.437500
vt 0.166667 0.875000
vt 0.083333 0.875000
vt 1.000000 0.312500
vt 0.916667 0.312500
vt 0.916667 0.281250
vt 1.000000 0.281250
vt 0.916667 0.250000
vt 1.000000 0.250000
vt 1.000000 0.750000
vt 0.916667 0.750000
vt 0.916667 0.718750
vt 1.000000 0.718750
vt 0.916667 0.687500
vt 1.000000 0.687500
vt 0.916667 0.218750
vt 1.000000 0.218750
vt 0.916667 0.187500
vt 1.000000 0.187500
vt 0.916667 0.656250
vt 1.000000 0.656250
vt 0.916667 0.625000
vt 1.000000 0.625000
vt 0.916667 0.156250
vt 1.000000 0.156250
vt 0.916667 0.125000
vt 1.000000 0.125000
vt 0.916667 0.593750
vt 1.000000 0.593750
vt 0.916667 0.562500
vt 1.000000 0.562500
vt 1.000000 0.062500
vt 0.916667 0.062500
vt 0.916667 0.531250
vt 1.000000 0.531250
vt 0.916667 0.500000
vt 1.000000 0.500000
vt 1.000000 0.937500
vt 0.958334 1.000000
vt 0.916667 0.937500
vt 0.958334 0.000000
vt 0.979167 0.031250
vt 0.937500 0.031250
vt 0.916667 0.468750
vt 1.000000 0.468750
vt 0.916667 0.437500
vt 1.000000 0.437500
vt 0.916667 0.906250
vt 1.000000 0.906250
vt 0.916667 0.875000
vt 1.000000 0.875000
vt 0.916667 0.406250
vt 1.000000 0.406250
vt 0.916667 0.375000
vt 1.000000 0.375000
vt 1.000000 0.812500
vt 0.916667 0.812500
vt 0.833333 0.750000
vt 0.750000 0.750000
vt 0.750000 0.718750
vt 0.833333 0.718750
vt 0.750000 0.687500
vt 0.833333 0.687500
vt 0.833333 0.250000
vt 0.750000 0.250000
vt 0.750000 0.218750
vt 0.833333 0.218750
vt 0.750000 0.187500
vt 0.833333 0.187500
vt 0.750000 0.656250
vt 0.833333 0.656250
vt 0.750000 0.625000
vt 0.833333 0.625000
vt 0.750000 0.156250
vt 0.833333 0.156250
vt 0.750000 0.125000
vt 0.833333 0.125000
vt 0.833333 0.562500
vt 0.750000 0.562500
vt 0.833333 0.062500
vt 0.750000 0.062500
vt 0.750000 0.531250
vt 0.833333 0.531250
vt 0.750000 0.500000
vt 0.833333 0.500000
vt 0.833333 0.937500
vt 0.791667 1.000000
vt 0.750000 0.937500
vt 0.791667 0.000000
vt 0.750000 0.468750
vt 0.833333 0.468750
vt 0.750000 0.437500
vt 0.833333 0.437500
vt 0.750000 0.875000
vt 0.833333 0.875000
vt 0.833333 0.906250
vt 0.750000 0.906250
vt 0.750000 0.406250
vt 0.833333 0.406250
vt 0.750000 0.375000
vt 0.833333 0.375000
vt 0.750000 0.812500
vt 0.833333 0.812500
vt 0.833333 0.843750
vt 0.750000 0.843750
vt 0.750000 0.343750
vt 0.833333 0.343750
vt 0.750000 0.312500
vt 0.833333 0.312500
vn 0.2119 0.9541 -0.2119
vn 0.6786 -0.2812 -0.6786
vn 0.3424 0.8750 -0.3424
vn 0.6283 -0.4588 -0.6283
vn 0.4578 0.7621 -0.4578
vn 0.5541 -0.6212 -0.5541
vn 0.5541 0.6212 -0.5541
vn 0.4578 -0.7621 -0.4578
vn 0.6283 0.4588 -0.6283
vn 0.3424 -0.8750 -0.3424
vn 0.6786 0.2812 -0.6786
vn 0.2119 -0.9541 -0.2119
vn 0.7039 0.0947 -0.7039
vn 0.0717 0.9948 -0.0717
vn 0.0717 -0.9948 -0.0717
vn 0.7039 -0.0947 -0.7039
vn 0.9270 -0.2812 0.2484
vn 0.4677 0.8750 0.1253
vn 0.8583 -0.4588 0.2300
vn 0.6254 0.7621 0.1676
vn 0.7569 -0.6212 0.2028
vn 0.7569 0.6212 0.2028
vn 0.6254 -0.7621 0.1676
vn 0.8583 0.4588 0.2300
vn 0.4677 -0.8750 0.1253
vn 0.9270 0.2812 0.2484
vn 0.2894 -0.9541 0.0775
vn 0.9616 0.0947 0.2577
vn 0.0980 0.9948 0.0263
vn 0.0980 -0.9948 0.0263
vn 0.9616 -0.0947 0.2577
vn 0.2894 0.9541 0.0775
vn 0.1253 0.8750 0.4677
vn 0.2300 -0.4588 0.8583
vn 0.1676 0.7621 0.6254
vn 0.2028 -0.6212 0.7569
vn 0.2028 0.6212 0.7569
vn 0.1676 -0.7621 0.6254
vn 0.2300 0.4588 0.8583
vn 0.1253 -0.8750 0.4677
vn 0.2484 0.2812 0.9270
vn 0.0775 -0.9541 0.2894
vn 0.2577 0.0947 0.9616
vn 0.0263 0.9948 0.0980
vn 0.0263 -0.9948 0.0980
vn 0.2577 -0.0947 0.9616
vn 0.0775 0.9541 0.2894
vn 0.2484 -0.2812 0.9270
vn -0.6283 -0.4588 0.6283
vn -0.4578 0.7621 0.4578
vn -0.5541 -0.6212 0.5541
vn -0.5541 0.6212 0.5541
vn -0.4578 -0.7621 0.4578
vn -0.6283 0.4588 0.6283
vn -0.3424 -0.8750 0.3424
vn -0.6786 0.2812 0.6786
vn -0.2119 -0.9541 0.2119
vn -0.7039 0.0947 0.7039
vn -0.0717 0.9948 0.0717
vn -0.0717 -0.9948 0.0717
vn -0.7039 -0.0947 0.7039
vn -0.2119 0.9541 0.2119
vn -0.6786 -0.2812 0.6786
vn -0.3424 0.8750 0.3424
vn -0.7569 -0.6212 -0.2028
vn -0.7569 0.6212 -0.2028
vn -0.6254 -0.7621 -0.1676
vn -0.8583 0.4588 -0.2300
vn -0.4677 -0.8750 -0.1253
vn -0.9270 0.2812 -0.2484
vn -0.2894 -0.9541 -0.0775
vn -0.9616 0.0947 -0.2577
vn -0.0980 0.9948 -0.0263
vn -0.0980 -0.9948 -0.0263
vn -0.9616 -0.0947 -0.2577
vn -0.2894 0.9541 -0.0775
vn -0.9270 -0.2812 -0.2484
vn -0.4677 0.8750 -0.1253
vn -0.8583 -0.4588 -0.2300
vn -0.6254 0.7621 -0.1676
vn -0.2028 0.6212 -0.7569
vn -0.1676 -0.7621 -0.6254
vn -0.2300 0.4588 -0.8583
vn -0.1253 -0.8750 -0.4677
vn -0.2484 0.2812 -0.9270
vn -0.0775 -0.9541 -0.2894
vn -0.2577 0.0947 -0.9616
vn -0.0263 0.9948 -0.0980
vn -0.0263 -0.9948 -0.0980
vn -0.2577 -0.0947 -0.9616
vn -0.0775 0.9541 -0.2894
vn -0.2484 -0.2812 -0.9270
vn -0.1253 0.8750 -0.4677
vn -0.2300 -0.4588 -0.8583
vn -0.1676 0.7621 -0.6254
vn -0.2028 -0.6212 -0.7569
usemtl pinzasBomba
s off
f 461/536/193 462/537/193 463/538/193 464/539/193
f 464/539/193 463/538/193 465/540/193 466/541/193
f 467/542/194 468/543/194 469/544/194 470/545/194
f 470/545/194 469/544/194 471/546/194 472/547/194
f 466/541/195 465/540/195 473/548/195 474/549/195
f 474/549/195 473/548/195 475/550/195 476/551/195
f 477/552/196 472/547/196 471/546/196 478/553/196
f 479/554/197 476/551/197 475/550/197 480/555/197
f 477/552/198 478/553/198 481/556/198 482/557/198
f 482/557/198 481/556/198 483/558/198 484/559/198
f 479/554/199 480/555/199 485/560/199 486/561/199
f 486/561/199 485/560/199 487/562/199 488/563/199
f 489/564/200 484/559/200 483/558/200 490/565/200
f 488/563/201 487/562/201 491/566/201 492/567/201
f 492/567/201 491/566/201 493/568/201 494/569/201
f 489/564/202 490/565/202 495/570/202 496/571/202
f 496/571/202 495/570/202 497/572/202 498/573/202
f 499/574/203 494/569/203 493/568/203 500/575/203
f 498/573/204 497/572/204 501/576/204 502/577/204
f 502/577/204 501/576/204 503/578/204 504/579/204
f 499/574/205 500/575/205 505/580/205 506/581/205
f 506/581/205 505/580/205 507/582/205 508/583/205
f 509/584/206 510/585/206 511/586/206
f 461/536/206 511/586/206 510/585/206 462/537/206
f 512/587/207 513/588/207 514/589/207
f 513/588/207 504/579/207 503/578/207 514/589/207
f 467/542/208 508/583/208 507/582/208 468/543/208
f 515/590/209 516/591/209 517/592/209 518/593/209
f 518/593/209 517/592/209 519/594/209 520/595/209
f 521/596/210 522/597/210 523/598/210 524/599/210
f 524/599/210 523/598/210 525/600/210 526/601/210
f 527/602/211 520/595/211 519/594/211 528/603/211
f 529/604/212 526/601/212 525/600/212 530/605/212
f 527/602/213 528/603/213 531/606/213 532/607/213
f 532/607/213 531/606/213 533/608/213 534/609/213
f 529/604/214 530/605/214 535/610/214 536/611/214
f 536/611/214 535/610/214 537/612/214 538/613/214
f 534/609/215 533/608/215 539/614/215 540/615/215
f 540/615/215 539/614/215 541/616/215 542/617/215
f 543/618/216 538/613/216 537/612/216 544/619/216
f 545/620/217 542/617/217 541/616/217 546/621/217
f 543/618/218 544/619/218 547/622/218 548/623/218
f 548/623/218 547/622/218 549/624/218 550/625/218
f 545/620/219 546/621/219 551/626/219 552/627/219
f 552/627/219 551/626/219 553/628/219 554/629/219
f 550/625/220 549/624/220 555/630/220 556/631/220
f 556/631/220 555/630/220 557/632/220 558/633/220
f 509/634/221 559/635/221 560/636/221
f 559/635/221 561/637/221 562/638/221 560/636/221
f 512/639/222 563/640/222 564/641/222
f 563/640/222 554/629/222 553/628/222 564/641/222
f 515/590/223 558/633/223 557/632/223 516/591/223
f 521/596/224 562/638/224 561/637/224 522/597/224
f 565/642/225 566/643/225 567/644/225 568/645/225
f 568/645/225 567/644/225 569/646/225 570/647/225
f 571/648/226 572/649/226 573/650/226 574/651/226
f 574/651/226 573/650/226 575/652/226 576/653/226
f 570/647/227 569/646/227 577/654/227 578/655/227
f 578/655/227 577/654/227 579/656/227 580/657/227
f 576/653/228 575/652/228 581/658/228 582/659/228
f 582/659/228 581/658/228 583/660/228 584/661/228
f 580/657/229 579/656/229 585/662/229 586/663/229
f 586/663/229 585/662/229 587/664/229 588/665/229
f 584/661/230 583/660/230 589/666/230 590/667/230
f 590/667/230 589/666/230 591/668/230 592/669/230
f 593/670/231 588/665/231 587/664/231 594/671/231
f 592/669/232 591/668/232 595/672/232 596/673/232
f 596/673/232 595/672/232 597/674/232 598/675/232
f 593/670/233 594/671/233 599/676/233 600/677/233
f 600/677/233 599/676/233 601/678/233 602/679/233
f 603/680/234 598/675/234 597/674/234 604/681/234
f 605/682/235 602/679/235 601/678/235 606/683/235
f 509/684/236 607/685/236 608/686/236
f 607/685/236 609/687/236 610/688/236 608/686/236
f 512/689/237 611/690/237 612/691/237
f 611/690/237 603/680/237 604/681/237 612/691/237
f 605/682/238 606/683/238 613/692/238 614/693/238
f 614/693/238 613/692/238 615/694/238 616/695/238
f 565/642/239 610/688/239 609/687/239 566/643/239
f 571/648/240 616/695/240 615/694/240 572/649/240
f 617/696/241 618/697/241 619/698/241 620/699/241
f 620/699/241 619/698/241 621/700/241 622/701/241
f 623/702/242 624/703/242 625/704/242 626/705/242
f 626/705/242 625/704/242 627/706/242 628/707/242
f 629/708/243 622/701/243 621/700/243 630/709/243
f 628/707/244 627/706/244 631/710/244 632/711/244
f 632/711/244 631/710/244 633/712/244 634/713/244
f 635/714/245 629/708/245 630/709/245 636/715/245
f 634/713/246 633/712/246 637/716/246 638/717/246
f 638/717/246 637/716/246 639/718/246 640/719/246
f 635/714/247 636/715/247 641/720/247 642/721/247
f 642/721/247 641/720/247 643/722/247 644/723/247
f 645/724/248 640/719/248 639/718/248 646/725/248
f 644/723/249 643/722/249 647/726/249 648/727/249
f 648/727/249 647/726/249 649/728/249 650/729/249
f 651/730/250 645/724/250 646/725/250 652/731/250
f 509/732/251 653/733/251 654/734/251
f 653/733/251 655/735/251 656/736/251 654/734/251
f 512/737/252 657/738/252 658/739/252
f 657/738/252 650/729/252 649/728/252 658/739/252
f 651/730/253 652/731/253 659/740/253 660/741/253
f 660/741/253 659/740/253 661/742/253 662/743/253
f 663/744/254 656/736/254 655/735/254 664/745/254
f 617/696/255 662/743/255 661/742/255 618/697/255
f 623/702/256 663/744/256 664/745/256 624/703/256
f 665/746/257 666/747/257 667/748/257 668/749/257
f 668/749/257 667/748/257 669/750/257 670/751/257
f 671/752/258 672/753/258 673/754/258 674/755/258
f 674/755/258 673/754/258 675/756/258 676/757/258
f 670/751/259 669/750/259 677/758/259 678/759/259
f 678/759/259 677/758/259 679/760/259 680/761/259
f 676/757/260 675/756/260 681/762/260 682/763/260
f 682/763/260 681/762/260 683/764/260 684/765/260
f 680/761/261 679/760/261 685/766/261 686/767/261
f 686/767/261 685/766/261 687/768/261 688/769/261
f 684/765/262 683/764/262 689/770/262 690/771/262
f 690/771/262 689/770/262 691/772/262 692/773/262
f 693/774/263 688/769/263 687/768/263 694/775/263
f 692/773/264 691/772/264 695/776/264 696/777/264
f 696/777/264 695/776/264 697/778/264 698/779/264
f 699/780/265 509/781/265 700/782/265
f 512/783/266 701/784/266 702/785/266
f 701/784/266 693/774/266 694/775/266 702/785/266
f 698/779/267 697/778/267 703/786/267 704/787/267
f 704/787/267 703/786/267 705/788/267 706/789/267
f 699/780/268 700/782/268 707/790/268 708/791/268
f 708/791/268 707/790/268 709/792/268 710/793/268
f 706/789/269 705/788/269 711/794/269 712/795/269
f 712/795/269 711/794/269 713/796/269 714/797/269
f 715/798/270 710/793/270 709/792/270 716/799/270
f 665/746/271 714/797/271 713/796/271 666/747/271
f 671/752/272 715/798/272 716/799/272 672/753/272
f 717/800/273 718/801/273 719/802/273 720/803/273
f 720/803/273 719/802/273 721/804/273 722/805/273
f 723/806/274 724/807/274 725/808/274 726/809/274
f 726/809/274 725/808/274 727/810/274 728/811/274
f 722/805/275 721/804/275 729/812/275 730/813/275
f 730/813/275 729/812/275 731/814/275 732/815/275
f 728/811/276 727/810/276 733/816/276 734/817/276
f 734/817/276 733/816/276 735/818/276 736/819/276
f 737/820/277 732/815/277 731/814/277 738/821/277
f 739/822/278 736/819/278 735/818/278 740/823/278
f 737/820/279 738/821/279 741/824/279 742/825/279
f 742/825/279 741/824/279 743/826/279 744/827/279
f 745/828/280 509/829/280 746/830/280
f 512/831/281 739/822/281 740/823/281
f 744/827/282 743/826/282 747/832/282 748/833/282
f 748/833/282 747/832/282 749/834/282 750/835/282
f 751/836/283 752/837/283 753/838/283 754/839/283
f 754/839/283 753/838/283 745/828/283 746/830/283
f 750/835/284 749/834/284 755/840/284 756/841/284
f 756/841/284 755/840/284 757/842/284 758/843/284
f 759/844/285 760/845/285 761/846/285 762/847/285
f 752/837/285 751/836/285 762/847/285 761/846/285
f 758/843/286 757/842/286 763/848/286 764/849/286
f 764/849/286 763/848/286 765/850/286 766/851/286
f 717/800/287 760/845/287 759/844/287 718/801/287
f 723/806/288 766/851/288 765/850/288 724/807/288
o Smoke_Domain_Cube.002
v -3.822784 -2.091925 4.909559
v -3.822784 14.984327 4.909559
v -3.822784 -2.091925 -4.909558
v -3.822784 14.984327 -4.909558
v 3.822784 -2.091925 4.909559
v 3.822784 14.984327 4.909559
v 3.822784 -2.091925 -4.909558
v 3.822784 14.984327 -4.909558
vt 0.375000 0.000000
vt 0.625000 0.000000
vt 0.625000 0.250000
vt 0.375000 0.250000
vt 0.625000 0.500000
vt 0.375000 0.500000
vt 0.625000 0.750000
vt 0.375000 0.750000
vt 0.625000 1.000000
vt 0.375000 1.000000
vt 0.125000 0.500000
vt 0.125000 0.750000
vt 0.875000 0.500000
vt 0.875000 0.750000
vn -1.0000 0.0000 0.0000
vn 0.0000 0.0000 -1.0000
vn 1.0000 0.0000 0.0000
vn 0.0000 0.0000 1.0000
vn 0.0000 -1.0000 0.0000
vn 0.0000 1.0000 0.0000
usemtl Smoke_Domain_Material.001
s off
f 767/852/289 768/853/289 770/854/289 769/855/289
f 769/855/290 770/854/290 774/856/290 773/857/290
f 773/857/291 774/856/291 772/858/291 771/859/291
f 771/859/292 772/858/292 768/860/292 767/861/292
f 769/862/293 773/857/293 771/859/293 767/863/293
f 774/856/294 770/864/294 768/865/294 772/858/294
