%YAML 1.1
%TAG !u! tag:unity3d.com,2011:
--- !u!114 &11400000
MonoBehaviour:
  m_ObjectHideFlags: 0
  m_CorrespondingSourceObject: {fileID: 0}
  m_PrefabInstance: {fileID: 0}
  m_PrefabAsset: {fileID: 0}
  m_GameObject: {fileID: 0}
  m_Enabled: 1
  m_EditorHideFlags: 0
  m_Script: {fileID: 11500000, guid: 00ac411702ff3624b9797f05a0124093, type: 3}
  m_Name: RH2
  m_EditorClassIdentifier: 
  name: RH2
  icon: {fileID: 0}
  increase: 0
  active: 0
  turretTipe: 2
  Tecnology: 0
  parent: []
  childsTecnologies: []
