17:52 - CONSULTAR VENTAS - admin (admin) consulto las ventas.
17:52 - VENTAS PENDIENTES - admin (admin) consulto las deudas
17:52 - CONSULTAR VENTAS - admin (admin) consulto las ventas.
17:52 - CONSULTAR VENTAS - admin (admin) consulto las ventas.
18:09 - CONSULTAR VENTAS - admin (admin) consulto las ventas.
18:09 - VENTA - admin (admin) hizo la venta 2 con un importe de 9.00e
18:10 - VENTA - admin (admin) hizo la venta 3 a Miguel Dominguez Pérez (DarkNeo2k4) con un importe de 10.00e
18:10 - CONSULTAR VENTAS - admin (admin) consulto las ventas.
18:10 - CONSULTAR VENTAS - admin (admin) consulto las ventas.
