20:15 - VENTA - admin (admin) hizo la venta 4 a Miguel Ángel Castillo Bellagona (Surah) con un importe de 1.00e
20:15 - CONSULTAR VENTAS - admin (admin) consulto las ventas.
20:15 - VENTAS PENDIENTES - admin (admin) consulto las deudas
20:16 - VENTAS PENDIENTES - admin (admin) consulto las deudas
20:16 - VENTAS PENDIENTES - admin (admin) cobro a Miguel Ángel Castillo Bellagona (Surah) una deuda de 1.00e
20:16 - VENTAS PENDIENTES - admin (admin) consulto las deudas
20:16 - VENTAS PENDIENTES - admin (admin) cobro a Miguel Dominguez Pérez (DarkNeo2k4) una deuda de 5.00e
