[
    {
      "name": "Aasimar Redeemer",
      "relativeURL": "Monsters.aspx?ID=333",
      "familyName": "Planar Scion",
      "level": "5",
      "alignment": "Neutral Good",
      "creatureType": "Humanoid",
      "size": "Medium",
      "nethysUrl": "https://2e.aonprd.com/Monsters.aspx?ID=333",
      "recallKnowledgeText": "Recall Knowledge (Society): DC 20",
      "flavorText": "Mortals whose ancestry has been influenced by celestials are known as aasimars, and angelkin, who have blood of angels coursing through their veins, are among the most common type of them. Many angelkin seek adventure as a means of doing good in the world.<br><br>",
      "rarity": "common",
      "traits": [
        {
          "traitName": "Aasimar",
          "traitSummary": "<i>Note from Nethys: This trait was not listed in the Glossary, its only use is as a Trait for some monsters.</i>",
          "traitURL": "https://2e.aonprd.com/Traits.aspx?ID=256"
        },
        {
          "traitName": "Human",
          "traitSummary": "A creature with this trait is a member of the human ancestry. Humans are a diverse array of people known for their adaptability. An ability with this trait can be used or selected only by humans.",
          "traitURL": "https://2e.aonprd.com/Traits.aspx?ID=90"
        },
        {
          "traitName": "Humanoid",
          "traitSummary": "Humanoid creatures reason and act much like humans. They typically stand upright and have two arms and two legs.",
          "traitURL": "https://2e.aonprd.com/Traits.aspx?ID=91"
        }
      ],
      "sourceDoc": "Bestiary pg. 263",
      "perceptionMod": "+11",
      "perceptionText": "darkvision",
      "languagesList": "Celestial, Common",
      "skills": [
        {
          "name": "Athletics",
          "mod": "+11"
        },
        {
          "name": "Diplomacy",
          "mod": "+12"
        },
        {
          "name": "Medicine",
          "mod": "+9"
        },
        {
          "name": "Religion",
          "mod": "+11"
        },
        {
          "name": "Society",
          "mod": "+7"
        }
      ],
      "attributes": {
        "str": "+4",
        "dex": "+1",
        "con": "+3",
        "int": "+0",
        "wis": "+2",
        "cha": "+3"
      },
      "items": [
        {
          "name": "crossbow",
          "itemDetails": "(10 bolts)"
        },
        {
          "name": "half plate"
        },
        {
          "name": "longsword"
        },
        {
          "name": "steel shield",
          "itemDetails": "(Hardness 5, HP 20, BT 10)"
        }
      ],
      "AC": "23",
      "ACDetails": "(25 with shield raised)",
      "saves": [
        {
          "name": "Fort",
          "mod": "+12"
        },
        {
          "name": "Ref",
          "mod": "+8"
        },
        {
          "name": "Will",
          "mod": "+11"
        },
        {
          "name": "all",
          "saveDetail": "+1 status to all saves vs. disease (against diseases, critical failures become failures)"
        }
      ],
      "weaknesses": "axe vulnerability, fire 10",
      "resistances": "bludgeoning 5, piercing 5",
      "immunities": "disease, paralyzed, poison, precision, unconscious",
      "HP": "73",
      "defensiveAbilities": [
        {
          "name": "Divine Grace",
          "actionCost": "reaction",
          "actionText": "<b>Trigger</b> The angelkin is targeted by a spell that allows a saving throw. <b>Effect</b> The scion gains a +2 circumstance bonus to the saving throw."
        },
        {
          "name": "Glimpse of Redemption",
          "actionCost": "reaction",
          "actionText": "<b>Trigger</b> An enemy damages one of the angelkin’s allies. Both the enemy and ally must be within 15 feet of the angelkin. <b>Effect</b> The angelkin causes its foe to hesitate under the weight of its sins as visions of possible redemption play out in its mind’s eye. The foe chooses one of two options: <ul><li>The ally is completely unharmed by the triggering damage.</li> <li>The ally gains resistance 7 to all damage against the triggering damage. After the damaging effect resolves, the enemy becomes enfeebled 2 until the end of its next turn.</li></ul>"
        },
        {
          "name": "Shield Block",
          "actionCost": "reaction",
          "actionText": "<b>Trigger</b> The monster has its shield raised and takes damage from a physical attack. <b>Effect</b> The monster snaps its shield into place to deflect a blow. The shield prevents the monster from taking an amount of damage up to the shield’s Hardness. The monster and the shield each take any remaining damage, possibly breaking or destroying the shield."
        }
      ],
      "speed": "20 feet",
      "attackActions": [
        {
          "name": "longsword",
          "actionCost": 1,
          "modifier": "+15",
          "traits": [
            "versatile P"
          ],
          "damageRolls": [
            "1d8+7 slashing"
          ]
        },
        {
          "name": "crossbow",
          "actionCost": 1,
          "modifier": "+12",
          "traits": [
            "range increment 120 feet",
            "reload 1"
          ],
          "damageRolls": [
            "1d8+3 piercing"
          ],
          "attackEffects": [
            "Knockdown"
          ]
        }
      ],
      "spellAbilities": [
        {
          "name": "Divine Innate Spells",
          "DC": "20",
          "spellLevels": [
            {
              "spells": [
                {
                  "spellName": "light",
                  "nethysUrl": "https://2e.aonprd.com/Spells.aspx?ID=171"
                }
              ],
              "level": "Cantrips (2nd)"
            }
          ]
        },
        {
          "name": "Champion Devotion Spells",
          "DC": "20",
          "spellLevels": [
            {
              "spells": [
                {
                  "spellName": "lay on hands",
                  "nethysUrl": "https://2e.aonprd.com/Spells.aspx?ID=395"
                }
              ],
              "level": "3rd",
              "detailText": "(1 Focus Point)",
              "numUses": "1"
            }
          ]
        }
      ]
    }
]