{
  "name": "puppet-r10k",
  "version": "6.0.0",
  "author": "Vox Pupuli",
  "summary": "Module for setting up dynamic environments using r10k",
  "license": "Apache-2.0",
  "source": "https://github.com/voxpupuli/puppet-r10k",
  "project_page": "https://github.com/voxpupuli/puppet-r10k",
  "issues_url": "https://github.com/voxpupuli/puppet-r10k/issues",
  "dependencies": [
    {"name":"puppetlabs/stdlib","version_requirement":">= 4.15.0 < 5.0.0"},
    {"name":"puppetlabs/ruby","version_requirement":">= 0.6.0 < 2.0.0"},
    {"name":"puppetlabs/gcc","version_requirement":">= 0.3.0 < 2.0.0"},
    {"name":"puppet/make","version_requirement":">= 1.0.0 < 2.0.0"},
    {"name":"puppetlabs/inifile","version_requirement":">= 1.4.1 < 2.0.0"},
    {"name":"puppetlabs/vcsrepo","version_requirement":">= 1.3.1 < 2.0.0"},
    {"name":"puppetlabs/git","version_requirement":">= 0.5.0 < 2.0.0"},
    {"name":"gentoo/portage","version_requirement":"2.3.0"}
  ],
  "data_provider": null,
  "operatingsystem_support": [
    {
      "operatingsystem": "RedHat",
      "operatingsystemrelease": [
        "6",
        "7"
      ]
    },
    {
      "operatingsystem": "CentOS",
      "operatingsystemrelease": [
        "6",
        "7"
      ]
    },
    {
      "operatingsystem": "OracleLinux",
      "operatingsystemrelease": [
        "6",
        "7"
      ]
    },
    {
      "operatingsystem": "Scientific",
      "operatingsystemrelease": [
        "5",
        "6",
        "7"
      ]
    },
    {
      "operatingsystem": "Ubuntu",
      "operatingsystemrelease": [
        "14.04"
      ]
    }
  ],
  "tags": [
    "git",
    "pe",
    "environment",
    "mcollective",
    "r10k"
  ],
  "requirements": [
    {
      "name": "puppet",
      "version_requirement": ">= 4.6.1 < 5.0.0"
    }
  ]
}
