{
  "name": "gita-sudo",
  "version": "0.1.0",
  "author": "Ruan Oliveira",
  "summary": "Modulo para gerenciar sudoers para o projeto GITA",
  "license": "Apache-2.0",
  "source": "https://gitlab.com/GW-DevOps-group/projeto_GITA/tree/master/terraformacao/ambiente/puppet",
  "project_page": "https://gitlab.com/GW-DevOps-group/projeto_GITA/tree/master/terraformacao/ambiente/puppet",
  "issues_url": "https://gitlab.com/GW-DevOps-group/projeto_GITA/issues",
  "dependencies": [
    {"name":"puppetlabs-stdlib","version_requirement":">= 1.0.0"}
  ],
  "data_provider": null
}

