<svg width="26" height="15" viewBox="0 0 26 15" fill="none" xmlns="http://www.w3.org/2000/svg">
<path d="M0.474815 6.6137L8.5917 0.267111C9.43065 -0.37167 10.6891 0.205293 10.6891 1.25619V3.37859C10.6891 4.05858 11.1505 4.65615 11.8426 4.65615H24.7416C25.4337 4.65615 26 5.15069 26 5.85129V9.18943C26 9.84882 25.4337 10.4258 24.7416 10.4258H11.8426C11.1505 10.4258 10.6891 10.9617 10.6891 11.6415V13.7639C10.6891 14.7942 9.43065 15.3712 8.61267 14.7324L0.516762 8.55065C-0.154402 8.07672 -0.175375 7.10824 0.474815 6.6137Z" fill="#008D96"/>
</svg>
