<svg width="36" height="24" viewBox="0 0 36 24" fill="none" xmlns="http://www.w3.org/2000/svg">
<path d="M34.8316 11.8116C33.0825 15.6268 26.7347 23.0279 17.712 23.0279C8.68918 23.0279 2.34138 15.6268 0.592285 11.8116C2.34138 7.9963 8.68918 0.595215 17.712 0.595215C26.7347 0.595215 33.0825 7.9963 34.8316 11.8116Z" fill="#008D96"/>
<path d="M17.7639 20.066C22.3284 20.066 26.0286 16.3657 26.0286 11.8013C26.0286 7.23684 22.3284 3.53662 17.7639 3.53662C13.1995 3.53662 9.49927 7.23684 9.49927 11.8013C9.49927 16.3657 13.1995 20.066 17.7639 20.066Z" fill="#008D96"/>
<path d="M17.7092 10.5157C17.7092 9.04911 16.5205 7.86035 15.0527 7.86035C13.5861 7.86035 12.3962 9.04911 12.3962 10.5157C12.3962 11.2836 12.7283 11.9708 13.2494 12.4574L13.2431 12.4585L17.7092 16.9241L22.1765 12.4585C22.1765 12.4574 22.1731 12.4574 22.1719 12.4556C22.6919 11.9697 23.0223 11.2836 23.0223 10.5157C23.0223 9.04911 21.8335 7.86035 20.3657 7.86035C18.8985 7.86035 17.7092 9.04911 17.7092 10.5157Z" fill="#008D96"/>
<path d="M17.71 23.6134C8.70801 23.6134 2.10308 16.5225 0.053617 12.0529C-0.0178723 11.8966 -0.0178723 11.7168 0.053617 11.5605C2.10308 7.09092 8.70801 0 17.71 0C26.712 0 33.3169 7.09092 35.3664 11.5605C35.4379 11.7168 35.4379 11.8966 35.3664 12.0529C33.3169 16.5225 26.712 23.6134 17.71 23.6134ZM1.24408 11.8067C3.03409 15.4352 9.14439 22.4327 17.71 22.4327C26.2756 22.4327 32.3859 15.4352 34.1759 11.8067C32.3859 8.1782 26.2756 1.18067 17.71 1.18067C9.14439 1.18067 3.03409 8.1782 1.24408 11.8067Z" fill="#393939"/>
<path d="M17.7661 20.6559C12.8832 20.6559 8.91113 16.6839 8.91113 11.8009C8.91113 6.91796 12.8832 2.94531 17.7661 2.94531C22.649 2.94531 26.6211 6.91796 26.6211 11.8009C26.6211 16.6839 22.649 20.6559 17.7661 20.6559ZM17.7661 4.12598C13.5346 4.12598 10.0918 7.56881 10.0918 11.8009C10.0918 16.0324 13.5346 19.4753 17.7661 19.4753C21.9976 19.4753 25.4405 16.0324 25.4405 11.8009C25.4405 7.56881 21.9976 4.12598 17.7661 4.12598Z" fill="#393939"/>
<path d="M17.7114 17.5169C17.5604 17.5169 17.4094 17.4592 17.2941 17.3439L12.8279 12.8783C12.8124 12.8628 12.7974 12.846 12.7835 12.8288C12.154 12.2096 11.8081 11.3922 11.8081 10.5182C11.8081 8.72869 13.2649 7.27246 15.0549 7.27246C16.152 7.27246 17.1234 7.81899 17.7114 8.65378C18.2995 7.81899 19.2709 7.27246 20.368 7.27246C22.158 7.27246 23.6148 8.72869 23.6148 10.5182C23.6148 11.3927 23.2694 12.2102 22.6405 12.8288C22.6267 12.846 22.6117 12.8628 22.5961 12.8783L18.1288 17.3439C18.0135 17.4592 17.8625 17.5169 17.7114 17.5169ZM13.7215 12.1018L17.7114 16.0917L21.7043 12.1007C21.7245 12.0741 21.7464 12.0499 21.7712 12.0269C22.1989 11.6273 22.4341 11.0912 22.4341 10.5182C22.4341 9.3796 21.5071 8.45313 20.368 8.45313C19.2288 8.45313 18.3018 9.3796 18.3018 10.5182C18.3018 10.8444 18.0377 11.1085 17.7114 11.1085C17.3852 11.1085 17.1211 10.8444 17.1211 10.5182C17.1211 9.3796 16.1941 8.45313 15.0549 8.45313C13.9158 8.45313 12.9888 9.3796 12.9888 10.5182C12.9888 11.0912 13.2251 11.6273 13.6546 12.0286C13.6788 12.0511 13.7013 12.0759 13.7215 12.1018Z" fill="#393939"/>
</svg>
