; ROME TOTAL REALISM ANABASIS III
; MAP REGIONS - ORBIS TERRARUM 2.0

Hibernia_I --------- AOR_Britannia - Hiberni
Hibernia_II -------- AOR_Britannia - Hiberni
Caledonia ---------- AOR_Britannia - Caledonii
Brigantia_I -------- AOR_Britannia - Damnonii
Brigantia_II ------- AOR_Britannia - Brigantii
Icenia ------------- AOR_Britannia - Catuvellauni
Ordovicia ---------- AOR_Britannia - Ordovicii
Cantiacia ---------- AOR_Britannia - Cantiaci
Dumnonia ----------- AOR_Britannia - Dumnonii

Armorica_I --------- AOR_Gallia - Veneti
Armorica_II -------- AOR_Gallia - Aulerci
Aquitania_I -------- AOR_Gallia - Pictavi
Aquitania_II ------- AOR_Gallia - Lemovici
Narbonensis_I ------ AOR_Gallia - Tectosagi
Narbonensis_II ----- AOR_Gallia - Arecomisci
Lugdunensis_I ------ AOR_Gallia - Arverni
Lugdunensis_II ----- AOR_Gallia - Biturigi
Lugdunensis_III ---- AOR_Gallia - Carnuti
Transalpina -------- AOR_Gallia - Allobrogi
Sequania_I --------- AOR_Gallia - Senonii
Sequania_II -------- AOR_Gallia - Sequani
Belgica_I ---------- AOR_Gallia - Nervii
Belgica_II --------- AOR_Gallia - Remi
Cisalpina ---------- AOR_Gallia - Insubri
Liguria ------------ AOR_Gallia - Liguri
Henetia ------------ AOR_Gallia - Heneti
Rhaetia ------------ AOR_Gallia - Vindelici
Noricum ------------ AOR_Gallia - Taurisci

Scandia ------------ AOR_Germania - Balti
Cisrhenania_I ------ AOR_Germania - Eburonii
Cisrhenania_II ----- AOR_Germania - Treveri
Transrhenania_I ---- AOR_Germania - Frisii
Transrhenania_II --- AOR_Germania - Chatti
Hermionia_I -------- AOR_Germania - Chaucii
Hermionia_II ------- AOR_Germania - Cherusci
Suebia ------------- AOR_Germania - Semnonii
Silesia ------------ AOR_Germania - Lugii
Hercynia_I --------- AOR_Germania - Boii
Hercynia_II -------- AOR_Germania - Cotini

Gallaecia ---------- AOR_Celtiberia - Gallaeci
Cantabria ---------- AOR_Celtiberia - Cantabri
Vasconia ----------- AOR_Celtiberia - Vasconii
Celtiberia_I ------- AOR_Celtiberia - Vaccei
Celtiberia_II ------ AOR_Celtiberia - Arevaci
Lusitania ---------- AOR_Celtiberia - Vettonii
Carpetania --------- AOR_Celtiberia - Carpetani

Lacetania ---------- AOR_Hispania - Ilergetii
Edetania ----------- AOR_Hispania - Edetani
Tartessus ---------- AOR_Hispania - Turduli
Baetica ------------ AOR_Hispania - Turduli
Oretania ----------- AOR_Hispania - Oretani
Bastetania --------- AOR_Hispania - Bastetani
Turdetania --------- AOR_Hispania - Turdetani
Gymnesiae ---------- AOR_Hispania - Baliari

Mauretania_I ------- AOR_Africa - Gaetuli
Mauretania_II ------ AOR_Africa - Mauri
Mauretania_III ----- AOR_Africa - Massaesyli
Mauretania_IV ------ AOR_Africa - Massaesyli
Mauretania_V ------- AOR_Africa - Massyli
Mauretania_VI ------ AOR_Africa - Massyli
Numidae ------------ AOR_Africa - Libyphoenices
Hipponensis -------- AOR_Africa - Libyphoenices
Zeugitana ---------- AOR_Africa - Libyphoenices
Byzacena ----------- AOR_Africa - Libyphoenices
Tripolitana -------- AOR_Africa - Garamanti
Libya_Deserta ------ AOR_Africa - Garamanti
Sardinia ----------- AOR_Africa - Sardi

Corsica ------------ AOR_Italia - Corsi
Tyrrhenia ---------- AOR_Italia - Etrusci
Umbria ------------- AOR_Italia - Umbri
Latium ------------- AOR_Italia - Latini
Campania ----------- AOR_Italia - Campani
Samnium ------------ AOR_Italia - Samniti
Apulia ------------- AOR_Italia - Messapii
Lucania ------------ AOR_Italia - Lucani

Sicilia_I ---------- AOR_Graecia - Sicani
Sicilia_II --------- AOR_Graecia - Siculi
Sicilia_III -------- AOR_Graecia - Elymi

Liburnia ----------- AOR_Illyria - Liburni
Delmatia ----------- AOR_Illyria - Delmati
Illyricum ---------- AOR_Illyria - Ardiaei

Dacia -------------- AOR_Thracia - Daci
Paionia ------------ AOR_Thracia - Agrianes
Thrake ------------- AOR_Thracia - Odrysai
Propontis ---------- AOR_Thracia - Odrysai

Makedonia_I -------- AOR_Graecia - Makedones
Makedonia_II ------- AOR_Graecia - Makedones
Thessalia ---------- AOR_Graecia - Thessaloi
Epeiros_I ---------- AOR_Graecia - Molossoi
Epeiros_II --------- AOR_Graecia - Taulantioi
Aitolia ------------ AOR_Graecia - Aitoloi
Attike ------------- AOR_Graecia - Athenaioi
Euboia ------------- AOR_Graecia - Euboioi
Akhaia ------------- AOR_Graecia - Akhaioi
Lakonike ----------- AOR_Graecia - Akhaioi
Krete -------------- AOR_Graecia - Kretikoi

Ophiussa ----------- AOR_Anatolia - Rhodioi
Kypros ------------- AOR_Anatolia - Kyprioi
Mysia -------------- AOR_Anatolia - Ionioi
Lydia -------------- AOR_Anatolia - Ionioi
Karia -------------- AOR_Anatolia - Ionioi
Bithynia ----------- AOR_Anatolia - Bithynoi
Pisidike ----------- AOR_Anatolia - Pisidikes
Pamphylia ---------- AOR_Anatolia - Pamphylioi
Paphlagonia -------- AOR_Anatolia - Paphlagonioi
Phrygia ------------ AOR_Anatolia - Phrygioi
Kilikia ------------ AOR_Anatolia - Kilikes
Pontos ------------- AOR_Anatolia - Pontikoi
Kappadokia --------- AOR_Anatolia - Kappadokes

Libye_I ------------ AOR_Aegyptus - Nasamonoi
Libye_II ----------- AOR_Aegyptus - Nasamonoi
Kyrenaia ----------- AOR_Aegyptus - Marmaridai
Marmarike ---------- AOR_Aegyptus - Marmaridai
Kato_Khora --------- AOR_Aegyptus - Aigyptioi
Ano_Khora_I -------- AOR_Aegyptus - Aigyptioi
Ano_Khora_II ------- AOR_Aegyptus - Aigyptioi
Ano_Khora_III ------ AOR_Aegyptus - Aigyptioi
Dodekaskhoinos ----- AOR_Aegyptus - Noubaioi
Noubia ------------- AOR_Aegyptus - Noubaioi
Erythraia_I -------- AOR_Aegyptus - Blemmyai
Erythraia_II ------- AOR_Aegyptus - Blemmyai
Aithiopia_I -------- AOR_Aegyptus - Aithiopes
Aithiopia_II ------- AOR_Aegyptus - Aithiopes
Azania_I ----------- AOR_Aegyptus - Aithiopes
Azania_II ---------- AOR_Aegyptus - Aithiopes

Syria_I ------------ AOR_Arabia - Syrioi
Syria_II ----------- AOR_Arabia - Syrioi
Osrhoene ----------- AOR_Arabia - Syrioi
Koile_Syria -------- AOR_Arabia - Syrioi
Phoinike ----------- AOR_Arabia - Phoinikes
Sinai -------------- AOR_Arabia - Ioudaioi
Idoumaia ----------- AOR_Arabia - Nabataioi
Lekhien ------------ AOR_Arabia - Lekhienoi
Kolpos_I ----------- AOR_Arabia - Lekhienoi
Kolpos_II ---------- AOR_Arabia - Minaioi
Minaia ------------- AOR_Arabia - Minaioi
Saba --------------- AOR_Arabia - Sabaioi
Hadramyta ---------- AOR_Arabia - Hadramytai
Eudaimonia --------- AOR_Arabia - Iobaritai
Maketa ------------- AOR_Arabia - Ikthyophagoi
Kolpos_III --------- AOR_Arabia - Gerrhaioi
Arabia ------------- AOR_Arabia - Arabioi

Hyperboreas -------- AOR_Sarmatia - Hyperborioi
Skythia_I ---------- AOR_Sarmatia - Skythioi
Borysthenike ------- AOR_Sarmatia - Skythioi
Taurike_I ---------- AOR_Sarmatia - Kimmerioi
Taurike_II --------- AOR_Sarmatia - Kimmerioi
Maiotida ----------- AOR_Sarmatia - Iazygai
Sirakene ----------- AOR_Sarmatia - Sirakenoi
Kaspiene ----------- AOR_Sarmatia - Legai
Skythia_II --------- AOR_Sarmatia - Aorsoi
Skythia_III -------- AOR_Sarmatia - Rhoxolanoi
Skythia_IV --------- AOR_Sarmatia - Alanoi

Kolkhis ------------ AOR_Media - Kolkhides
Hiberia ------------ AOR_Media - Hiberoi
Albania ------------ AOR_Media - Albanoi
Armenia_II --------- AOR_Media - Alarodioi
Kordouene ---------- AOR_Media - Kardukhoi
Kommagene ---------- AOR_Media - Kommagenoi
Armenia_I ---------- AOR_Media - Kommagenoi
Atropatene_I ------- AOR_Media - Kadousioi
Atropatene_II ------ AOR_Media - Kyrtioi
Adiabene ----------- AOR_Media - Assyrioi
Sittakene ---------- AOR_Media - Assyrioi
Mesopotamia -------- AOR_Media - Khaldaioi
Kharakene ---------- AOR_Media - Khaldaioi
Sousiane ----------- AOR_Media - Elymaioi
Media -------------- AOR_Media - Medoi
Rhagiane ----------- AOR_Media - Mardoi
Hyrkania ----------- AOR_Media - Derbikes
Paraitakene -------- AOR_Media - Kossaioi

Persis ------------- AOR_Persia - Perses
Karmania ----------- AOR_Persia - Karmanioi
Sagartia ----------- AOR_Persia - Sagartioi
Gedrosia ----------- AOR_Persia - Ikthyophagoi
Drangiane_I -------- AOR_Persia - Drangianoi
Drangiane_II ------- AOR_Persia - Drangianoi
Arakhosia ---------- AOR_Persia - Arakhosioi

Astauene ----------- AOR_Scythia - Parnoi
Parthyaia_I -------- AOR_Scythia - Parnoi
Parthyaia_II ------- AOR_Scythia - Parnoi
Dahastene_I -------- AOR_Scythia - Daoi
Dahastene_II ------- AOR_Scythia - Daoi
Dahastene_III ------ AOR_Scythia - Daoi
Skythia_V ---------- AOR_Scythia - Thyssagetai
Transoxiane -------- AOR_Scythia - Massagetai
Areia -------------- AOR_Scythia - Areioi
Margiane ----------- AOR_Scythia - Tapyroi
Sogdiane_I --------- AOR_Scythia - Sogdianoi
Sogdiane_II -------- AOR_Scythia - Sogdianoi
Baktriane ---------- AOR_Scythia - Baktrioi

Paropamisos -------- AOR_India - Assakenoi
Gandhara_I --------- AOR_India - Assakenoi
Gandhara_II -------- AOR_India - Oxydrakai
Sattagydia_I ------- AOR_India - Malloi
Sattagydia_II ------ AOR_India - Malloi
Sattagydia_III ----- AOR_India - Sabrakai
Makarene ----------- AOR_India - Oreitai
Patalene ----------- AOR_India - Oreitai
