plan

{

floor		underlay_fields_group_B.cas overlay_fields_group_B.cas
ground_types	ground_no_grass.tga	-96,	-96,	96,	96

hay_field_double,		-32,	0,	0,	0
corn_field_square,		31,	28,	0,	0
bush_A,				14,	-10,	0,	0
bush_A,				18,	-34,	40,	0
bush_A,				9,	-50,	85,	0
bush_A,				34,	-32,	-35,	0
tree_A,				47,	-16,	0,	0
tree_A,				-13,	34,	75,	0
tree_B,				26,	-39,	-95,	0
tree_E,				48,	-32,	30,	0
tree_F,				24,	-21,	50,	0

}
