quote_1		
quoted_2	
quote_3		
quoted_4	
quote_5		
quoted_6	
quote_7		
quoted_8	
quote_9		
quoted_10	
quote_11	
quoted_12	
quote_13	
quoted_14	
quote_15	
trans_16	
quoted_17	
quote_18	
quoted_19	
quote_20	
quoted_21	
quote_22	
trans_23	
quoted_24	
quote_25	
quoted_26	
quote_27	
quoted_28	
quote_29	
quoted_30	
quote_31	
trans_32	
quoted_33	
quote_34	
quoted_35	
quote_36	
quoted_37	
quote_38	
quoted_39	
quote_40	
quoted_41	
quote_42	
quoted_43	
quote_44	
quoted_45	
quote_46	
quoted_47	
quote_48	
quoted_49	
quote_50	
quoted_51	
quote_52	
quoted_53	
quote_54	
quoted_55	
quote_56	
quoted_57	
quote_58	
quoted_59	
quote_60	
quoted_61	
quote_62	
quoted_63	
quote_64	
quoted_65	
quote_66	
quoted_67	
quote_68	
quoted_69	
quote_70	
quoted_71	
quote_72	
quoted_73	
quote_74	
quoted_75	
quote_76	
quoted_77	
quote_78	
quoted_79	
quote_80	
quoted_81	
quote_82	
quoted_83	
quote_84	
quoted_85	
quote_86	
quoted_87	
quote_88	
quoted_89	
quote_90	
quoted_91	
quote_92	
quoted_93	
quote_94	
quoted_95	
quote_96	
quoted_97	
quote_98	
quoted_99	
quote_100	
quoted_101	
quote_102	
quoted_103	
quote_104	
quoted_105	
quote_106	
quoted_107	
quote_108	
quoted_109	
quote_110	
quoted_111	
quote_112	
quoted_113	
quote_114	
quoted_115	
quote_116	
trans_117	
quoted_118	
quote_119	
quoted_120	
quote_121	
quoted_122	
quote_123	
quoted_124	
quote_125	
quoted_126	
quote_127	
trans_128	
quoted_129	
quote_130	
quoted_131	
quote_132	
quoted_133	
quote_134	
quoted_135	
quote_136	
quoted_137	
quote_138	
quoted_139	
quote_140	
quoted_141	
quote_142	
quoted_143	
quote_144	
quoted_145	
quote_146	
quoted_147	
quote_148	
quoted_149	
quote_150	
quoted_151	
quote_152	
quoted_153	
quote_154	
quoted_155	
quote_156	
quoted_157	
quote_158	
quoted_159	
quote_160	
quoted_161	
quote_162	
quoted_163	
quote_164	
quoted_165	
quote_166	
quoted_167	
quote_168	
quoted_169	
quote_170	
quoted_171	
quote_172	
quoted_173	
quote_174	
quoted_175	
quote_176	
quoted_177	
quote_178	
quoted_179	
quote_180	
quoted_181	
quote_182	
quoted_183	
quote_184	
quoted_185	
quote_186	
quoted_187	
quote_188	
quoted_189	
quote_190	
quoted_191	
quote_192	
quoted_193	
quote_194	
quoted_195	
quote_196	
quoted_197	
quote_198	
quoted_199	
quote_200	
quoted_201	
quote_202	
quoted_203	
quote_204	
quoted_205	
quote_206	
quoted_207	
quote_208	
quoted_209	
quote_210	
quoted_211	
quote_212	
quoted_213	
quote_214	
quoted_215	
quote_216	
quoted_217	
quote_218	
quoted_219	
quote_220	
quoted_221	
quote_222	
quoted_223	
quote_224	
quoted_225	
quote_226	
quoted_227	
quote_228	
quoted_229	
quote_230	
quoted_231	
quote_232	
quoted_233	
quote_234	
quoted_235	
quote_236	
quoted_237	
quote_238	
quoted_239	
quote_240	
quoted_241	
quote_242	
trans_243	
quoted_244	
quote_245	
quoted_246	
quote_247	
quoted_248	
quote_249	
quoted_250	
quote_251	
quoted_252	
quote_253	
quoted_254	
quote_255	
quoted_256	
quote_257	
quoted_258	
quote_259	
quoted_260	
quote_261	
quoted_262	
quote_263	
quoted_264	
quote_265	
quoted_266	
quote_267	
quoted_268	
quote_269	
quoted_270	
quote_271	
quoted_272	
quote_273	
quoted_274	
quote_275	
quoted_276	
quote_277	
quoted_278	
quote_279	
quoted_280	
quote_281	
quoted_282	
quote_283	
quoted_284	
quote_285	
quoted_286	
quote_287	
quoted_288	
quote_289	
quoted_290	
quote_291	
quoted_292	
quote_293	
quoted_294	
quote_295	
quoted_296	
quote_297	
quoted_298	
quote_299	
quoted_300	
quote_301	
quoted_302	
quote_303	
quoted_304	
quote_305	
quoted_306	
quote_307	
quoted_308	
quote_309	
quoted_310	
quote_311	
quoted_312	
quote_313	
quoted_314	
quote_315	
quoted_316	
quote_317	
quoted_318	
quote_319	
quoted_320	
quote_321	
quoted_322	
quote_323	
quoted_324	
quote_325	
quoted_326	
quote_327	
quoted_328	
quote_329	
quoted_330	
quote_331	
quoted_332	
quote_333	
quoted_334	
quote_335	
quoted_336	
quote_337	
quoted_338	
quote_339	
quoted_340	
quote_341	
trans_342	
quoted_343	
quote_344	
quoted_345	
quote_346	
quoted_347	
quote_348	
quoted_349	
quote_350	
trans_351	
quoted_352	
quote_353	
quoted_354	
quote_355	
quoted_356	
quote_357	
quoted_358	
quote_359	
quoted_360	
quote_361	
quoted_362	
quote_363	
quoted_364	
quote_365	
quoted_366	
quote_367	
quoted_368	
quote_369	
quoted_370	
quote_371	
quoted_372	
quote_373	
quoted_374	
quote_375	
quoted_376	
quote_377	
quoted_378	
quote_379	
quoted_380	
quote_381	
quoted_382	
quote_383	
quoted_384	
quote_385	
quoted_386	
quote_387	
quoted_388	
quote_389	
quoted_390	
quote_391	
trans_392	
quoted_393	
quote_394	
quoted_395	
quote_396	
trans_397	
quoted_398	
quote_399	
trans_400	
quoted_401	
quote_402	
quoted_403	
quote_404	
quoted_405	
quote_406	
trans_407	
quoted_408	
quote_409	
quoted_410	
quote_411	
trans_412	
quoted_413	
quote_414	
trans_415	
quoted_416	
quote_417	
quoted_418	
quote_419	
quoted_420	
quote_421	
quoted_422	
quote_423	
quoted_424	
quote_425	
quoted_426	
quote_427	
quoted_428	
quote_429	
trans_430	
quoted_431	
quote_432	
trans_433	
quoted_434	
quote_435	
trans_436	
quoted_437	
quote_438	
quoted_439	
quote_440	
quoted_441	
quote_442	
quoted_443	
quote_444	
quoted_445	
quote_446	
quoted_447	
quote_448	
quoted_449	
quote_450	
quoted_451	
quote_452	
quoted_453	
quote_454	
quoted_455	
quote_456	
quoted_457	
quote_458	
quoted_459	
quote_460	
quoted_461	
quote_462	
quoted_463	
quote_464	
quoted_465	
quote_466	
quoted_467	
quote_468	
quoted_469	
quote_470	
quoted_471	
quote_472	
quoted_473	
quote_474	
quoted_475	
quote_476	
quoted_477	
quote_478	
quoted_479	
quote_480	
quoted_481	
quote_482	
quoted_483	
quote_484	
quoted_485	
quote_486	
quoted_487	
quote_488	
quoted_489	
quote_490	
quoted_491	
quote_492	
quoted493	
quote_494	
quoted_495	
quote_496	
quoted_497	
quote_498	
quoted_499	
quote_500	
quoted_501	
quote_502	
quoted_503	
quote_504	
quoted_505	
quote_506	
quoted_507	
quote_508	
quoted_509	
quote_510	
quoted_511	
quote_512	
quoted_513	
quote_514	
quoted_515	
quote_516	
quoted_517	
quote_518	
quoted_519	
quote_520	
quoted_521	
quote_522	
quoted_523	
quote_524	
quoted_525	
quote_526	
quoted_527	
quote_528	
quoted_529	
quote_530	
quoted_531	
quote_532	
quoted_533	
quote_534	
quoted_535	
quote_536	
quoted_537	
quote_538	
quoted_539	
quote_540	
quoted_541	
quote_542	
quoted_543	
quote_544	
quoted_545	
quote_546	
quoted_547	
quote_548	
quoted_549	
quote_550	
quoted_551	
quote_552	
quoted_553	
quote_554	
quoted_555	
quote_556	
quoted_557	
quote_558	
quoted_559	
quote_560	
quoted_561	
quote_562	
quoted_563	
quote_564	
quoted_565	
quote_566	
quoted_567	
quote_568	
quoted_569	
quote_670	
quoted_571	
quote_572	
quoted_573	
quote_574	
quoted_575	
quote_576	
quoted_577	
quote_578	
quoted_579	
quote_580	
quoted_581	
quote_582	
quoted_583	
quote_584	
quoted_585	
quote_586	
quoted_587	
quote_588	
quoted_589	
quote_590	
quoted_591	
quote_592	
quoted_593	
quote_594	
quoted_595	
quote_596	
quoted_597	
quote_598	
quoted_599	
quote_600	
quoted_601	
quote_602	
quoted_603	
quote_604	
quoted_605	
quote_606	
quoted_607	
quote_608	
quoted_609	
quote_610	
quoted_611	
quote_612	
quoted_613	
quote_614	
quoted_615	
quote_616	
quoted_617	
quote_618	
quoted_619	
quote_620	
quoted_621	
quote_622	
quoted_623	
quote_624	
quoted_625	
quote_626	
quoted_627	
quote_628	
quoted_629	
quote_630	
quoted_631	
quote_632	
quoted_633	
quote_634	
quoted_635	
quote_636	
quoted_637	
quote_638	
quoted_639	
quote_640	
quoted_641	
quote_642	
quoted_643	
quote_644	
quoted_645	
quote_646	
trans_647	
quoted_648	
quote_649	
quoted_650	
quote_651	
quoted_652	
quote_653	
quoted_654	
quote_655	
quoted_656	
quote_657	
quoted_658	
quote_659	
quoted_660	
quote_661	
quoted_662	
quote_663	
quoted_664	
quote_665	
quoted_666	
quote_667	
quoted_668	
quote_669	
trans_670	
quoted_671	
quote_672	
quoted_673	
quote_674	
quoted_675	
quote_676	
quoted_677	
quote_678	
quoted_679	
quote_680	
quoted_681	
quote_682	
quoted_683	
quote_684	
quoted_685	
quote_686	
quoted_687	
quote_688	
quoted_689	
quote_690	
quoted_691	
quote_692	
quoted_693	
quote_694	
quoted_695	
quote_696	
quoted_697	
quote_698	
quoted_699	
quote_700	
quoted_701	
quote_702	
quoted_703	
quote_704	
quoted_705	
quote_706	
trans_707	
quoted_708	
quote_709	
quoted_710	
quote_711	
quoted_712	
quote_713	
quoted_714	
quote_715	
quoted_716	
quote_717	
quoted_718	
quote_719	
quoted_720	
quote_721	
quoted_722	
quote_723	
quoted_724	
quote_725	
quoted_726	
quote_727	
quoted_728	
quote_729	
quoted_730	
quote_731	
quoted_732	
quote_733	
quoted_734	
quote_735	
quoted_736	
quote_737	
quoted_738	
quote_739	
trans_740	
quoted_741	
quote_742	
quoted_743	
quote_744	
quoted_745	
quote_746	
quoted_747	
quote_748	
quoted_749	
quote_750	
quoted_751	
quote_752	
quoted_753	
quote_754	
quoted_755	
quote_756	
quoted_757	
quote_758	
quoted_759	
quote_760	
quoted_761	
quote_762	
quoted_763	
quote_764	
quoted_765	
quote_766	
quoted_767	
quote_768	
quoted_769	
quote_770	
quoted_771	
quote_772	
quoted_773	
quote_774	
quoted_775	
quote_776	
quoted_777	
quote_778	
quoted_779	
quote_780	
quoted_781	
quote_782	
quoted_783	
quote_784	
quoted_785	
quote_786	
quoted_787	
quote_788	
quoted_789	
quote_790	
quoted_791	
quote_792	
quoted_793	
quote_794	
quoted_795	
quote_796	
quoted_797	
quote_798	
quoted_799	
quote_800	
quoted_801	
quote_802	
quoted_803	
quote_804	
quoted_805	
quote_806	
quoted_807	
quote_808	
quoted_809	
quote_810	
quoted_811	
quote_812	
quoted_813	
quote_814	
quoted_815	
quote_816	
quoted_817	
quote_818	
quoted_819	
quote_820	
quoted_821	
quote_822	
quoted_823	
quote_824	
quoted_825	
quote_826	
quoted_827	
quote_828	
quoted_829	
quote_830	
quoted_831	
quote_832	
quoted_833	
quote_834	
quoted_835	
quote_836	
trans_837	
quoted_838	
quote_839	
trans_840	
quoted_841	
quote_842	
quoted_843	
quote_844	
quoted_845	
quote_846	
quoted_847	
quote_848	
quoted_849	
quote_850	
quoted_851	
quote_852	
quoted_853	
quote_854	
quoted_855	
quote_856	
quoted_857	
quote_858	
quoted_859	
quote_860	
quoted_861	
quote_862	
quoted_863	
quote_864	
quoted_865	
quote_866	
quoted_867	
quote_868	
quoted_869	
quote_870	
quoted_871	
quote_872	
quoted_873	
quote_874	
quoted_875	
quote_876	
quoted_877	
quote_878	
quoted_879	
quote_880	
quoted_881	
quote_882	
quoted_883	
quote_884	
quoted_885	
quote_886	
quoted_887	
quote_888	
quoted_889	
quote_890	
quoted_891	
quote_892	
quoted_893	
quote_894	
trans_895	
quoted_896	
quote_897	
quoted_898	
quote_899	
quoted_900	
quote_901	
quoted_902	
quote_903	
quoted_904	
quote_905	
quoted_906	
quote_907	
quoted_908	
quote_909	
quoted_910	
quote_911	
quoted_912	
quote_913	
quoted_914	
quote_915	
quoted_916	
quote_917	
quoted_918	
quote_919	
quoted_920	
quote_921	
quoted_922	
quote_923	
quoted_924	
quote_925	
quoted_926	
quote_927	
trans_928	
quoted_929	
quote_930	
trans_931	
quoted_932	
quote_933	
trans_934	
quoted_935	
quote_936	
trans_937	
quoted_938	
quote_939	
trans_940	
quoted_941	
quote_942	
trans_943	
quoted_944	
quote_945	
trans_946	
quoted_947	
quote_948	
trans_949	
quoted_950	
quote_951	
trans_952	
quoted_953	
quote_954	
trans_955	
quoted_956	
quote_957	
trans_958	
quoted_959	
quote_960	
trans_961	
quoted_962	
quote_963	
trans_964	
quoted_965	
quote_966	
trans_967	
quoted_968	
quote_969	
trans_970	
quoted_971	
quote_972	
quoted_973	
quote_974	
quoted_975	
quote_976	
quoted_977	
quote_978	
trans_979	
quoted_980	
quote_981	
trans_982	
quoted_983	
quote_984	
quoted_985	
quote_986	
quoted_987	
quote_988	
quoted_989	
quote_990	
quoted_991	
quote_992	
quoted_993	
quote_994	
quoted_995	
quote_996	
quoted_997	
quote_998	
quoted_999	
quote_1000	
quoted_1001	
quote_1002	
quoted_1003	
quote_1004	
quoted_1005	
quote_1006	
quoted_1007	
quote_1008	
quoted_1009	
quote_1010	
trans_1011	
quoted_1012	
quote_1013	
quoted_1014	
quote_1015	
quoted_1016	
quote_1017	
quoted_1018	
quote_1019	
quoted_1020	
quote_1021	
quoted_1022	
quote_1023	
quoted_1024	
quote_1025	
quoted_1026	
quote_1027	
quoted_1028	
quote_1029	
quoted_1030	
quote_1031	
quoted_1032	
quote_1033	
quoted_1034	
quote_1035	
quoted_1036	
quote_1037	
quoted_1038	
quote_1039	
quoted_1040	
quote_1041	
quoted_1042	
quote_1043	
quoted_1044	
quote_1045	
quoted_1046	
quote_1047	
quoted_1048	
quote_1049	
quoted_1050	
quote_1051	
quoted_1052	
quote_1053	
quoted_1054	
quote_1055	
quoted_1056	
quote_1057	
quoted_1058	
quote_1059	
quoted_1060	
quote_1061	
quoted_1062	
quote_1063	
quoted_1064	
quote_1065	
quoted_1066	
quote_1067	
quoted_1068	
quote_1069	
quoted_1070	
quote_1071	
quoted_1072	
quote_1073	
quoted_1074	
quote_1075	
quoted_1076	
quote_1077	
quoted_1078	
quote_1079	
trans_1080	
quoted_1081	
quote_1082	
trans_1083	
quoted_1084	
quote_1085	
trans_1086	
quoted_1087	
quote_1088	
quoted_1089	
quote_1090	
quoted_1091	
quote_1092	
quoted_1093	
quote_1094	
quoted_1095	
quote_1096	
quoted_1097	
quote_1098	
quoted_1099	
quote_1100	
quoted_1101	
quote_1102	
quoted_1103	
quote_1104	
quoted_1105	
quote_1106	
quoted_1107	
quote_1108	
quoted_1109	
quote_1110	
quoted_1111	
quote_1112	
quoted_1113	
quote_1114	
quoted_1115	
quote_1116	
quoted_1117	
quote_1118	
quoted_1119	
quote_1120	
quoted_1121	
quote_1122	
quoted_1123	
quote_1124	
quoted_1125	
quote_1126	
quoted_1127	
quote_1128	
quoted_1129	
quote_1130	
quoted_1131	
quote_1132	
quoted_1133	
quote_1134	
quoted_1135	
quote_1136	
quoted_1137	
quote_1138	
quoted_1139	
quote_1140	
quoted_1141	
quote_1142	
quoted_1143	
quote_1144	
quoted_1145	
quote_1146	
quoted_1147	
quote_1148	
quoted_1149	
quote_1150	
quoted_1151	
quote_1152	
quoted_1153	
quote_1154	
quoted_1155	
quote_1156	
quoted_1157	
quote_1158	
quoted_1159	
quote_1160	
quoted_1161	
quote_1162	
quoted_1163	
quote_1164	
quoted_1165	
quote_1166	
quoted_1167	
quote_1168	
quoted_1169	
quote_1170	
quoted_1171	
quote_1172	
quoted_1173	
quote_1174	
quoted_1175	
quote_1176	
quoted_1177	
quote_1178	
quoted_1179	
quote_1180	
quoted_1181	
quote_1182	
quoted_1183	
quote_1184	
quoted_1185	
quote_1186	
quoted_1187	
quote_1188	
quoted_1189	
quote_1190	
quoted_1191	
quote_1192	
quoted_1193	
quote_1194	
quoted_1195	
quote_1196	
quoted_1197	
quote_1198	
trans_1199	
quoted_1200	
quote_1201	
quoted_1202	
quote_1203	
quoted_1204	
quote_1205	
quoted_1206	
quote_1207	
quoted_1208	
quote_1209	
quoted_1210	
quote_1211	
quoted_1212	
quote_1213	
quoted_1214	
quote_1215	
quoted_1216	
quote_1217	
quoted_1218	
quote_1219	
quoted_1220	
quote_1221	
quoted_1222	
quote_1223	
quoted_1224	
quote_1225	
quoted_1226	
quote_1227	
quoted_1228	
quote_1229	
quoted_1230	
quote_1231	
quoted_1232	
quote_1233	
quoted_1234	
quote_1235	
quoted_1236	
quote_1237	
quoted_1238	
quote_1239	
quoted_1240	
quote_1241	
quoted_1242	
quote_1243	
quoted_1244	
quote_1245	
quoted_1246	
quote_1247	
quoted_1248	
quote_1249	
quoted_1250	
quote_1251	
quoted_1252	
quote_1253	
quoted_1254	
quote_1255	
quoted_1256	
quote_1257	
quoted_1258	
quote_1259	
quoted_1260	
quote_1261	
trans_1262	
quoted_1263	
quote_1264	
quoted_1265	
quote_1266	
quoted_1267	
quote_1268	
quoted_1269	
quote_1270	
quoted_1271	
quote_1272	
quoted_1273	
quote_1274	
quoted_1275	
quote_1276	
quoted_1277	
quote_1278	
quoted_1279	
quote_1280	
quoted_1281	
quote_1282	
quoted_1283	
quote_1284	
quoted_1285	
quote_1286	
quoted_1287	
quote_1288	
quoted_1289	
quote_1290	
quoted_1291	
quote_1292	
quoted_1293	
quote_1294	
quoted_1295	
quote_1296	
trans_1297	
quoted_1298	
quote_1299	
quoted_1300	
quote_1301	
quoted_1302	
quote_1303	
quoted_1304	
quote_1305	
quoted_1306	
quote_1307	
quoted_1308	
quote_1309	
quoted_1310	
quote_1311	
quoted_1312	
quote_1313	
quoted_1314	
quote_1315	
quoted_1316	
quote_1317	
quoted_1318	
quote_1319	
quoted_1320	
quote_1321	
quoted_1322	
quote_1323	
quoted_1324	
quote_1325	
quoted_1326	
quote_1327	
quoted_1328	
quote_1329	
quoted_1330	
quote_1331	
quoted_1332	
quote_1333	
quoted_1334	
quote_1335	
quoted_1336	
quote_1337	
quoted_1338	
quote_1339	
quoted_1340	
quote_1341	
quoted_1342	
quote_1343	
quoted_1344	
quote_1345	
quoted_1346	
quote_1347	
quoted_1348	
quote_1349	
quoted_1350	
quote_1351	
quoted_1352	
quote_1353	
quoted_1354	
quote_1355	
quoted_1356	
quote_1357	
quoted_1358	
quote_1359	
quoted_1360	
quote_1361	
quoted_1362	
quote_1363	
quoted_1364	
quote_1365	
quoted_1366	
quote_1367	
quoted_1368	
quote_1369	
quoted_1370	
quote_1371	
quoted_1372	
quote_1373	
quoted_1374	
quote_1375	
quoted_1376	
quote_1377	
quoted_1378	
quote_1379	
quoted_1380	
quote_1381	
quoted_1382	
quote_1383	
quoted_1384	
quote_1385	
quoted_1386	
quote_1387	
quoted_1388	
quote_1389	
quoted_1390	
quote_1391	
quoted_1392	
quote_1393	
quoted_1394	
quote_1395	
quoted_1396	
quote_1397	
quoted_1398	
quote_1399	
quoted_1400	
quote_1401	
quoted_1402	
quote_1403	
quoted_1404	
quote_1405	
quoted_1406	
quote_1407	
quoted_1408	
quote_1409	
quoted_1410	
quote_1411	
quoted_1412	
quote_1413	
quoted_1414	
quote_1415	
quoted_1416	
quote_1417	
quoted_1418	
quote_1419	
quoted_1420	
quote_1421	
quoted_1422	
quote_1423	
quoted_1424	
quote_1425	
quoted_1426	
quote_1427	
quoted_1428	
quote_1429	
quoted_1430	
quote_1431	
quoted_1432	
quote_1433	
quoted_1434	
quote_1435	
quoted_1436	
quote_1437	
quoted_1438	
quote_1439	
quoted_1440	
quote_1441	
quoted_1442	
quote_1443	
quoted_1444	
quote_1445	
quoted_1446	
quote_1447	
quoted_1448	
quote_1449	
quoted_1450	
quote_1451	
quoted_1452	
quote_1453	
quoted_1454	
quote_1455	
quoted_1456	
quote_1457	
quoted_1458	
quote_1459	
quoted_1460	
quote_1461	
quoted_1462	
quote_1463	
quoted_1464	
quote_1465	
quoted_1466	
quote_1467	
quoted_1468	
quote_1469	
quoted_1470	
quote_1471	
quoted_1472	
quote_1473	
quoted_1474	
quote_1475	
quoted_1476	
quote_1477	
quoted_1478	
quote_1479	
quoted_1480	
quote_1481	
quoted_1482	
quote_1483	
quoted_1484	
quote_1485	
quoted_1486	
quote_1487	
quoted_1488	
quote_1489	
quoted_1490	
quote_1491	
quoted_1492	
quote_1493	
trans_1494	
quoted_1495	
quote_1496	
trans_1497	
quoted_1498	
quote_1499	
trans_1500	
quoted_1501	
quote_1502	
trans_1503	
quoted_1504	
quote_1505	
trans_1506	
quoted_1507	
quote_1508	
trans_1509	
quoted_1510	
quote_1511	
trans_1512	
quoted_1513	
quote_1514	
quoted_1515	
quote_1516	
quoted_1517	
quote_1518	
quoted_1519	
quote_1520	
quoted_1521	
quote_1522	
quoted_1523	
quote_1524	
quoted_1525	
quote_1526	
quoted_1527	
quote_1528	
quoted_1529	
quote_1530	
quoted_1531	
quote_1532	
quoted_1533	
quote_1534	
quoted_1535	
quote_1536	
quoted_1537	
quote_1538	
quoted_1539	
quote_1540	
quoted_1541	
quote_1542	
quoted_1543	
quote_1544	
quoted_1545	
quote_1546	
quoted_1547	
quote_1548	
quoted_1549	
quote_1560	
quoted_1561	
quote_1562	
quoted_1563	
quote_1564	
quoted_1565	
quote_1566	
quoted_1567	
quote_1568	
quoted_1569	
quote_1570	
quoted_1571	
quote_1572	
quoted_1573	
quote_1574	
quoted_1575	
quote_1576	
quoted_1577	
quote_1578	
quoted_1579	
quote_1580	
quoted_1581	
quote_1582	
quoted_1583	
quote_1584	
quoted_1585	
quote_1586	
quoted_1587	
quote_1588	
quoted_1589	
quote_1590	
quoted_1591	
quote_1592	
quoted_1593	
quote_1594	
quoted_1595	
quote_1596	
quoted_1597	
quote_1598	
trans_1599	
quoted_1600	
quote_1601	
trans_1602	
quoted_1603	
quote_1604	
quoted_1605	
quote_1606	
quoted_1607	
quote_1608	
quoted_1609	
quote_1610	
quoted_1611	
quote_1612	
trans_1613	
quoted_1614	
quote_1615	
trans_1616	
quoted_1617	
quote_1618	
quoted_1619	
quote_1620	
quoted_1621	
quote_1622	
quoted_1623	
quote_1624	
quoted_1625	
quote_1626	
quoted_1627	
quote_1628	
quoted_1629	
quote_1630	
quoted_1631	
quote_1632	
quoted_1633	
quote_1634	
quoted_1635	
quote_1636	
quoted_1637	
quote_1638	
trans_1639	
quoted_1640	
quote_1641	
trans_1642	
quoted_1643	
quote_1644	
trans_1645	
quoted_1646	
quote_1647	
trans_1648	
quoted_1649	
quote_1650	
quoted_1651	
quote_1652	
trans_1653	
quoted_1654	
quote_1655	
trans_1656	
quoted_1657	
quote_1658	
trans_1659	
quoted_1660	
quote_1661	
quoted_1662	
quote_1663	
quoted_1664	
quote_1665	
trans_1666	
quoted_1667	
quote_1668	
quoted_1669	
quote_1670	
trans_1671	
quoted_1672	
quote_1673	
trans_1674	
quoted_1675	
quote_1676	
trans_1677	
quoted_1678	
quote_1679	
quoted_1680	
quote_1681	
quoted_1682	
quote_1683	
quoted_1684	
quote_1685	
quoted_1686	
quote_1687	
quoted_1688	
quote_1689	
quoted_1690	
quote_1691	
quoted_1692	
quote_1693	
quoted_1694	
quote_1695	
quoted_1696	
quote_1697	
quoted_1698	
