{
  "npcs": [ 2025, 2026, 2027, 2028, 2029, 2030, 2031, 2032, 7245, 7244, 7246 ],
  "guaranteed": [
    { "id": 592, "min": 1, "max": 1 } //Ashes
  ],
  "PVPWorld": true,
  "tables": [
    {
      "name": "Weapons/Armour",
      "points": 1,
      "items": [
        { "id": 1353, "min": 1, "max": 1, "points": 6 }, //Steel axe
        { "id": 1365, "min": 1, "max": 1, "points": 6 }, //Steel battleaxe
        { "id": 1311, "min": 1, "max": 1, "points": 6 }, //Steel 2h sword
        { "id": 1073, "min": 1, "max": 1, "points": 3 }, //Adamant platelegs
        { "id": 1163, "min": 1, "max": 1, "points": 3 }, //Rune full helm
        { "id": 1197, "min": 1, "max": 1, "points": 1 } //Mithril kiteshield
      ]
    },
    {
      "name": "Runes",
      "points": 1,
      "items": [
        { "id": 554, "min": 37, "max": 37, "points": 3 }, //Fire rune
        { "id": 554, "min": 75, "max": 75, "points": 3 }, //Fire rune
        { "id": 562, "min": 12, "max": 12, "points": 3 }, //Chaos rune
        { "id": 562, "min": 15, "max": 15, "points": 1 }, //Chaos rune
        { "id": 560, "min": 5, "max": 5, "points": 1 } //Death rune
      ]
    },
    {
      "name": "Other",
      "points": 1,
      "items": [
        { "id": 13307, "min": 10, "max": 20, "points": 12 }, //Blood money
        { "id": 2357, "min": 1, "max": 1, "points": 6 }, //Gold bar
        { "id": 361, "min": 1, "max": 1, "points": 6 }, //Tuna
        { "id": 1734, "min": 10, "max": 10, "points": 1 } //Thread
      ]
    }
  ]
}
