{
  "npcs": [ 3135, 2593, 2594, 2595, 2596, 2597, 2598, 2599, 2600, 2601, 2602, 2603, 2604, 2605, 2606, 2607, 2608, 2609, 2610, 2611, 2612 ],
  "PVPWorld": true,
  "guaranteed": [
    { "id": 2859, "min": 1, "max": 1 } //Wolf bones
  ],
  "tables": [
    {
      "name": "Food",
      "points": 1,
      "items": [
        { "id": 2138, "min": 5, "max": 5, "points": 1 }, //Raw chicken
        { "id": 2132, "min": 5, "max": 5, "points": 1 }, //Raw beef
        { "id": 2136, "min": 1, "max": 5, "points": 1 }, //Raw bear meat
        { "id": 1993, "min": 1, "max": 1, "points": 1 } //Jug of wine
      ]
    },
    {
      "name": "Weapons and armour",
      "points": 1,
      "items": [
        { "id": 1325, "min": 1, "max": 1, "points": 3 }, //Steel scimitar
        { "id": 1353, "min": 1, "max": 1, "points": 3 }, //Steel axe
        { "id": 886, "min": 50, "max": 50, "points": 1 }, //Steel arrow
        { "id": 1157, "min": 1, "max": 1, "points": 1 }, //Steel full helm
        { "id": 1329, "min": 1, "max": 1, "points": 1 }, //Mithril scimitar
        { "id": 1181, "min": 1, "max": 1, "points": 1 }, //Mithril sq shield
        { "id": 1109, "min": 1, "max": 1, "points": 1 }, //Mithril chainbody
        { "id": 1147, "min": 1, "max": 1, "points": 1 }, //Rune med helm
        { "id": 830, "min": 1, "max": 1, "points": 1 } //Rune javelin
      ]
    },
    {
      "name": "Herbs",
      "points": 1,
      "items": [
        { "id": 203, "min": 1, "max": 1, "points": 6 }, //Grimy tarromin
        { "id": 199, "min": 1, "max": 1, "points": 6 }, //Grimy guam leaf
        { "id": 201, "min": 1, "max": 1, "points": 6 }, //Grimy marrentill
        { "id": 207, "min": 1, "max": 1, "points": 3 }, //Grimy ranarr weed
        { "id": 211, "min": 1, "max": 1, "points": 3 }, //Grimy avantoe
        { "id": 215, "min": 1, "max": 1, "points": 3 }, //Grimy cadantine
        { "id": 205, "min": 1, "max": 1, "points": 3 }, //Grimy harralander
        { "id": 209, "min": 1, "max": 1, "points": 3 }, //Grimy irit leaf
        { "id": 213, "min": 1, "max": 1, "points": 1 }, //Grimy kwuarm
        { "id": 2485, "min": 1, "max": 1, "points": 1 }, //Grimy lantadyme
        { "id": 217, "min": 1, "max": 1, "points": 1 } //Grimy dwarf weed
      ]
    },
    {
      "name": "Other",
      "points": 1,
      "items": [
        { "id": 13307, "min": 1, "max": 10, "points": 10 }, //Blood money
        { "id": 6814, "min": 1, "max": 1, "points": 10 }, //Fur
        { "id": 958, "min": 1, "max": 1, "points": 10 }, //Grey wolf fur
        { "id": 2353, "min": 1, "max": 1, "points": 10 }, //Steel bar
        { "id": 590, "min": 1, "max": 1, "points": 10 }, //Tinderbox
        { "id": 245, "min": 1, "max": 1, "points": 10 }, //Wine of zamorak
        { "id": 440, "min": 1, "max": 5, "points": 10 }, //Iron ore
        { "id": 453, "min": 2, "max": 2, "points": 10 }, //Coal
        { "id": 983, "min": 1, "max": 1, "points": 5 }, //Brass key
        { "id": 239, "min": 1, "max": 1, "points": 5 } //White berries
      ]
    }
  ]
}
