{
  "npcs": [ 2891 ],
  "guaranteed": [
    { "id": 526, "min": 1, "max": 1 } //Bones
  ],
  "PVPWorld": true,
  "tables": [
    {
      "name": "Runes",
      "points": 1,
      "items": [
        { "id": 554, "min": 18, "max": 18, "points": 6 }, //Fire rune
        { "id": 558, "min": 10, "max": 10, "points": 6 }, //Mind rune
        { "id": 558, "min": 18, "max": 18, "points": 6 }, //Mind rune
        { "id": 563, "min": 3, "max": 3, "points": 3 }, //Law rune
        { "id": 556, "min": 10, "max": 10, "points": 3 }, //Air rune
        { "id": 557, "min": 18, "max": 18, "points": 3 }, //Earth rune
        { "id": 562, "min": 4, "max": 4, "points": 3 }, //Chaos rune
        { "id": 561, "min": 5, "max": 5, "points": 1 }, //Nature rune
        { "id": 565, "min": 2, "max": 2, "points": 1 } //Blood rune
      ]
    },
    {
      "name": "Weapons/Armour",
      "points": 1,
      "items": [
        { "id": 1387, "min": 1, "max": 1, "points": 25 }, //Staff of fire
        { "id": 1379, "min": 1, "max": 1, "points": 25 }, //Staff
        { "id": 1033, "min": 1, "max": 1, "points": 10 }, //Zamorak robe (bottom)
        { "id": 1035, "min": 1, "max": 1, "points": 1 } //Zamorak robe (top)
      ]
    }
  ]
}
