{
  "npcs": [ 5853, 5854 ],
  "PVPWorld": true,
  "tables": [
    {
      "name": "Drops",
      "points": 1,
      "items": [
        { "id": 6020, "min": 1, "max": 1, "points": 1 } //Leaves
      ]
    }
  ]
}
