{
  "npcs": [ 7399 ],
  "guaranteed": [],
  "PVPWorld": true,
  "tables": [
    {
      "name": "Weapons/Armour",
      "points": 1,
      "items": [
        { "id": 1353, "min": 1, "max": 1, "points": 9 }, //Steel axe
        { "id": 1311, "min": 1, "max": 1, "points": 9 }, //Steel 2h sword
        { "id": 1365, "min": 1, "max": 1, "points": 9 }, //Steel battleaxe
        { "id": 1197, "min": 1, "max": 1, "points": 6 }, //Mithril kiteshield
        { "id": 4127, "min": 1, "max": 1, "points": 3 }, //Mithril boots
        { "id": 1119, "min": 1, "max": 1, "points": 3 }, //Steel platebody
        { "id": 1163, "min": 1, "max": 1, "points": 1 } //Rune full helm
      ]
    },
    {
      "name": "Runes",
      "points": 1,
      "items": [
        { "id": 562, "min": 15, "max": 15, "points": 3 }, //Chaos rune
        { "id": 560, "min": 5, "max": 5, "points": 3 }, //Death rune
        { "id": 555, "min": 5, "max": 21, "points": 1 }, //Water rune
        { "id": 565, "min": 7, "max": 7, "points": 1 } //Blood rune
      ]
    },
    {
      "name": "Other",
      "points": 1,
      "items": [
        { "id": 13307, "min": 1, "max": 10, "points": 10 }, //Bloody money
        { "id": 2357, "min": 1, "max": 1, "points": 10 }, //Gold bar
        { "id": 1734, "min": 10, "max": 10, "points": 1 } //Thread
      ]
    }
  ]
}
