
{
  "npcs": [ 5275, 5276 ],
  "PVPWorld": true,
  "tables": [
    {
      "name": "Drops",
      "points": 1,
      "items": [
        { "id": 13451, "min": 1, "max": 1, "points": 1 } //Ensouled monkey head
      ]
    }
  ]
}
