{
  "npcs": [ 3169, 3177, 3178, 3170, 3179, 3172, 3171, 3180, 3173, 3181, 3174, 3182, 3183, 3175, 3176 ],
  "guaranteed": [
    { "id": 526, "min": 1, "max": 1 }, //Bones
    { "id": 314, "min": 1, "max": 7 } //Feather
  ],
  "PVPWorld": true,
  "tables": [
    {
      "name": "Runes ",
      "points": 1,
      "items": [
        { "id": 556, "min": 15, "max": 15, "points": 6 }, //Air rune
        { "id": 556, "min": 30, "max": 30, "points": 6 }, //Air rune
        { "id": 555, "min": 30, "max": 30, "points": 6 }, //Water rune
        { "id": 563, "min": 2, "max": 2, "points": 3 }, //Law rune
        { "id": 561, "min": 9, "max": 9, "points": 3 }, //Nature rune
        { "id": 558, "min": 5, "max": 5, "points": 3 }, //Mind rune
        { "id": 565, "min": 11, "max": 11, "points": 1 }, //Blood rune
        { "id": 562, "min": 3, "max": 3, "points": 1 }, //Chaos rune
        { "id": 562, "min": 16, "max": 16, "points": 1 }, //Chaos rune
        { "id": 559, "min": 12, "max": 12, "points": 1 } //Body rune
      ]
    },
    {
      "name": "Herbs",
      "points": 1,
      "items": [
        { "id": 199, "min": 1, "max": 1, "points": 3 }, //Grimy guam leaf
        { "id": 201, "min": 1, "max": 1, "points": 3 }, //Grimy marrentill
        { "id": 203, "min": 1, "max": 1, "points": 3 }, //Grimy tarromin
        { "id": 205, "min": 1, "max": 1, "points": 3 }, //Grimy harralander
        { "id": 207, "min": 1, "max": 1, "points": 3 }, //Grimy ranarr weed
        { "id": 209, "min": 1, "max": 1, "points": 3 }, //Grimy irit leaf
        { "id": 211, "min": 1, "max": 1, "points": 3 }, //Grimy avantoe
        { "id": 213, "min": 1, "max": 1, "points": 1 }, //Grimy kwuarm
        { "id": 215, "min": 1, "max": 1, "points": 1 }, //Grimy cadantine
        { "id": 2485, "min": 1, "max": 1, "points": 1 }, //Grimy lantadyme
        { "id": 217, "min": 1, "max": 1, "points": 1 } //Grimy dwarf weed
      ]
    },
    {
      "name": "Other",
      "points": 1,
      "items": [
        { "id": 442, "min": 1, "max": 1, "points": 12 }, //Silver ore
        { "id": 2361, "min": 4, "max": 4, "points": 12 }, //Adamantite bar
        { "id": 5678, "min": 1, "max": 1, "points": 12 }, //Rune dagger(p+)
        { "id": 373, "min": 5, "max": 5, "points": 6 }, //Swordfish
        { "id": 175, "min": 5, "max": 5, "points": 6 }, //Antipoison(3)
        { "id": 13505, "min": 1, "max": 1, "points": 3 }, //Ensouled aviansie head
        { "id": 9431, "min": 1, "max": 1, "points": 3 } //Runite limbs
      ]
    }
  ]
}
