{
  "points": 0,
  "items": [],
  "npcs": [
	6615
  ],
  "petItem": 13181,
  "petRarity": 1500,
  "tables": [
	{
	  "name": "Equipment",
	  "points": 15,
	  "items": [
		{
		  "id": 11090,
		  "amount": 1,
		  "points": 3
		},
		{
		  "id": 1113,
		  "amount": 1,
		  "points": 3
		},
		{
		  "id": 1275,
		  "amount": 1,
		  "points": 3
		},
		{
		  "id": 1333,
		  "amount": 1,
		  "points": 3
		},
		{
		  "id": 1247,
		  "amount": 1,
		  "points": 3
		},
		{
		  "id": 1289,
		  "amount": 1,
		  "points": 3
		},
		{
		  "id": 1347,
		  "amount": 1,
		  "points": 3
		},
		{
		  "id": 1319,
		  "amount": 1,
		  "points": 3
		},
		{
		  "id": 4587,
		  "amount": 1,
		  "points": 1
		}
	  ],
	  "tables": []
	},
	{
	  "name": "Other",
	  "points": 35,
	  "items": [
		{
		  "id": 995,
		  "min": 500,
		  "max": 4000,
		  "points": 3
		},
		{
		  "id": 7198,
		  "amount": 3,
		  "points": 3
		},
		{
		  "id": 2298,
		  "amount": 8,
		  "points": 3
		},
		{
		  "id": 1784,
		  "amount": 25,
		  "points": 3
		},
		{
		  "id": 6017,
		  "amount": 10,
		  "points": 3
		},
		{
		  "id": 2434,
		  "amount": 1,
		  "points": 3
		},
		{
		  "id": 385,
		  "amount": 1,
		  "points": 3
		},
		{
		  "id": 1624,
		  "amount": 4,
		  "points": 3
		},
		{
		  "id": 1622,
		  "amount": 6,
		  "points": 3
		},
		{
		  "id": 4696,
		  "amount": 30,
		  "points": 1
		}
	  ],
	  "tables": []
	},
	{
	  "name": "Shards",
	  "points": 1,
	  "items": [
		{
		  "id": 11930,
		  "amount": 1,
		  "points": 1
		},
		{
		  "id": 11933,
		  "amount": 1,
		  "points": 1
		}
	  ],
	  "tables": []
	}
  ]
}