{
  "npcs": [ 7389 ],
  "PVPWorld": true,
  "tables": [
    {
      "name": "Runes",
      "points": 1,
      "items": [
        { "id": 557, "min": 9, "max": 9, "points": 9 }, //Earth rune
        { "id": 554, "min": 12, "max": 12, "points": 3 }, //Fire rune
        { "id": 561, "min": 3, "max": 3, "points": 1 } //Nature rune
      ]
    },
    {
      "name": "Seeds",
      "points": 1,
      "items": [
        { "id": 5318, "min": 1, "max": 4, "points": 3 }, //Potato seed
        { "id": 5319, "min": 1, "max": 3, "points": 3 }, //Onion seed
        { "id": 5324, "min": 1, "max": 3, "points": 3 }, //Cabbage seed
        { "id": 5322, "min": 1, "max": 2, "points": 3 }, //Tomato seed
        { "id": 5320, "min": 1, "max": 2, "points": 3 }, //Sweetcorn seed
        { "id": 5323, "min": 1, "max": 1, "points": 1 }, //Strawberry seed
        { "id": 5321, "min": 1, "max": 1, "points": 1 } //Watermelon seed
      ]
    },
    {
      "name": "Herbs",
      "points": 1,
      "items": [
        { "id": 199, "min": 1, "max": 2, "points": 3 }, //Grimy guam leaf
        { "id": 201, "min": 1, "max": 2, "points": 3 }, //Grimy marrentill
        { "id": 203, "min": 1, "max": 2, "points": 3 }, //Grimy tarromin
        { "id": 205, "min": 1, "max": 2, "points": 3 }, //Grimy harralander
        { "id": 207, "min": 1, "max": 2, "points": 3 }, //Grimy ranarr weed
        { "id": 209, "min": 1, "max": 2, "points": 3 }, //Grimy irit leaf
        { "id": 211, "min": 1, "max": 2, "points": 1 }, //Grimy avantoe
        { "id": 213, "min": 1, "max": 2, "points": 1 }, //Grimy kwuarm
        { "id": 215, "min": 1, "max": 2, "points": 1 }, //Grimy cadantine
        { "id": 2485, "min": 1, "max": 2, "points": 1 }, //Grimy lantadyme
        { "id": 217, "min": 1, "max": 2, "points": 1 } //Grimy dwarf weed
      ]
    },
    {
      "name": "Other",
      "points": 1,
      "items": [
        { "id": 13307, "min": 5, "max": 10, "points": 6 }, //Blood money
        { "id": 227, "min": 1, "max": 1, "points": 3 }, //Vial of water
        { "id": 235, "min": 1, "max": 1, "points": 3 }, //Unicorn horn dust
        { "id": 221, "min": 1, "max": 1, "points": 3 }, //Eye of newt
        { "id": 223, "min": 1, "max": 1, "points": 3 }, //Red spiders' eggs
        { "id": 225, "min": 1, "max": 1, "points": 3 }, //Limpwurt root
        { "id": 231, "min": 1, "max": 1, "points": 3 }, //Snape grass
        { "id": 239, "min": 1, "max": 1, "points": 3 }, //White berries
        { "id": 4119, "min": 1, "max": 1, "points": 1 } //Bronze boots
      ]
    }
  ]
}
