{
  "npcs": [ 2261, 5940 ],
  "guaranteed": [
    { "id": 526, "min": 1, "max": 1 } //Bones
  ],
  "PVPWorld": true,
  "tables": [
    {
      "name": "Runes/Talismans",
      "points": 1,
      "items": [
        { "id": 555, "min": 1, "max": 39, "points": 6 }, //Water rune
        { "id": 557, "min": 2, "max": 37, "points": 6 }, //Earth rune
        { "id": 1438, "min": 1, "max": 1, "points": 6 }, //Air talisman
        { "id": 1448, "min": 1, "max": 1, "points": 3 }, //Mind talisman
        { "id": 1442, "min": 1, "max": 1, "points": 3 }, //Fire talisman
        { "id": 1454, "min": 1, "max": 1, "points": 3 }, //Cosmic talisman
        { "id": 1446, "min": 1, "max": 1, "points": 3 }, //Body talisman
        { "id": 1444, "min": 1, "max": 1, "points": 1 }, //Water talisman
        { "id": 1440, "min": 1, "max": 1, "points": 1 } //Earth talisman
      ]
    },
    {
      "name": "Weaponry/Armour",
      "points": 1,
      "items": [
        { "id": 1119, "min": 1, "max": 1, "points": 6 }, //Steel platebody
        { "id": 3098, "min": 1, "max": 1, "points": 6 }, //Black claws
        { "id": 1125, "min": 1, "max": 1, "points": 6 }, //Black platebody
        { "id": 1355, "min": 1, "max": 1, "points": 3 }, //Mithril axe
        { "id": 6151, "min": 1, "max": 1, "points": 3 }, //Rock-shell gloves
        { "id": 6145, "min": 1, "max": 1, "points": 3 }, //Rock-shell boots
        { "id": 1341, "min": 1, "max": 1, "points": 1 }, //Black warhammer
        { "id": 1301, "min": 1, "max": 1, "points": 1 }, //Adamant longsword
        { "id": 1345, "min": 1, "max": 1, "points": 1 } //Adamant warhammer
      ]
    },
    {
      "name": "Seeds",
      "points": 1,
      "items": [
        { "id": 5106, "min": 1, "max": 1, "points": 6 }, //Poison ivy seed
        { "id": 5281, "min": 1, "max": 1, "points": 6 }, //Belladonna seed
        { "id": 5291, "min": 1, "max": 1, "points": 6 }, //Guam seed
        { "id": 5292, "min": 1, "max": 1, "points": 6 }, //Marrentill seed
        { "id": 5293, "min": 1, "max": 1, "points": 6 }, //Tarromin seed
        { "id": 5294, "min": 1, "max": 1, "points": 6 }, //Harralander seed
        { "id": 5296, "min": 1, "max": 1, "points": 6 }, //Toadflax seed
        { "id": 5295, "min": 1, "max": 1, "points": 6 }, //Ranarr seed
        { "id": 5297, "min": 1, "max": 1, "points": 3 }, //Irit seed
        { "id": 5298, "min": 1, "max": 1, "points": 3 }, //Avantoe seed
        { "id": 5300, "min": 1, "max": 1, "points": 3 }, //Snapdragon seed
        { "id": 5301, "min": 1, "max": 1, "points": 1 }, //Cadantine seed
        { "id": 5302, "min": 1, "max": 1, "points": 1 }, //Lantadyme seed
        { "id": 5303, "min": 1, "max": 1, "points": 1 }, //Dwarf weed seed
        { "id": 5304, "min": 1, "max": 1, "points": 1 } //Torstol seed
      ]
    },
    {
      "name": "Herbs",
      "points": 1,
      "items": [
        { "id": 199, "min": 1, "max": 1, "points": 3 }, //Grimy guam leaf
        { "id": 201, "min": 1, "max": 1, "points": 3 }, //Grimy marrentill
        { "id": 203, "min": 1, "max": 1, "points": 3 }, //Grimy tarromin
        { "id": 205, "min": 1, "max": 1, "points": 3 }, //Grimy harralander
        { "id": 207, "min": 1, "max": 1, "points": 3 }, //Grimy ranarr weed
        { "id": 209, "min": 1, "max": 1, "points": 3 }, //Grimy irit leaf
        { "id": 211, "min": 1, "max": 1, "points": 3 }, //Grimy avantoe
        { "id": 213, "min": 1, "max": 1, "points": 3 }, //Grimy kwuarm
        { "id": 215, "min": 1, "max": 1, "points": 1 }, //Grimy cadantine
        { "id": 2485, "min": 1, "max": 1, "points": 1 }, //Grimy lantadyme
        { "id": 217, "min": 1, "max": 1, "points": 1 } //Grimy dwarf weed
      ]
    },
    {
      "name": "Other",
      "points": 1,
      "items": [
        { "id": 13307, "min": 10, "max": 20, "points": 12 }, //Blood money
        { "id": 377, "min": 1, "max": 1, "points": 12 }, //Raw lobster
        { "id": 363, "min": 1, "max": 1, "points": 12 }, //Raw bass
        { "id": 590, "min": 1, "max": 1, "points": 12 }, //Tinderbox
        { "id": 6161, "min": 1, "max": 1, "points": 3 }, //Rock-shell splinter
        { "id": 6157, "min": 1, "max": 1, "points": 3 }, //Rock-shell chunk
        { "id": 6159, "min": 1, "max": 1, "points": 3 }, //Rock-shell shard
        { "id": 405, "min": 1, "max": 1, "points": 1 } //Casket
      ]
    }
  ]
}
