{
  "points": 0,
  "items": [],
  "guaranteed": [
	{
	  "id": 532
	}
  ],
  "npcs": [
	6767
  ],
  "tables": [
	{
	  "name": "Armour",
	  "points": 2,
	  "items": [
		{
		  "id": 2489,
		  "amount": 1,
		  "points": 500
		},
		{
		  "id": 1407,
		  "amount": 1,
		  "points": 52
		},
		{
		  "id": 1399,
		  "amount": 1,
		  "points": 51
		},
		{
		  "id": 1147,
		  "amount": 1,
		  "points": 51
		},
		{
		  "id": 1113,
		  "amount": 1,
		  "points": 51
		},
		{
		  "id": 1347,
		  "amount": 1,
		  "points": 51
		},
		{
		  "id": 1373,
		  "amount": 1,
		  "points": 11
		},
		{
		  "id": 13576,
		  "amount": 1,
		  "points": 2
		}
	  ],
	  "tables": []
	},
	{
	  "name": "Ores",
	  "points": 3,
	  "items": [
		{
		  "id": 441,
		  "min": 24,
		  "max": 35,
		  "points": 2
		},
		{
		  "id": 454,
		  "min": 20,
		  "max": 23,
		  "points": 2
		},
		{
		  "id": 452,
		  "min": 3,
		  "max": 5,
		  "points": 1
		}
	  ],
	  "tables": []
	},
	{
	  "name": "Herbs",
	  "points": 1,
	  "items": [
		{
		  "id": 214,
		  "min": 1,
		  "max": 3,
		  "points": 3
		},
		{
		  "id": 218,
		  "min": 1,
		  "max": 3,
		  "points": 3
		},
		{
		  "id": 2486,
		  "min": 1,
		  "max": 3,
		  "points": 3
		},
		{
		  "id": 216,
		  "min": 1,
		  "max": 3,
		  "points": 3
		},
		{
		  "id": 5313,
		  "amount": 1,
		  "points": 3
		},
		{
		  "id": 5295,
		  "amount": 1,
		  "points": 3
		},
		{
		  "id": 5300,
		  "amount": 1,
		  "points": 3
		},
		{
		  "id": 5321,
		  "amount": 15,
		  "points": 1
		},
		{
		  "id": 5304,
		  "amount": 1,
		  "points": 1
		},
		{
		  "id": 5314,
		  "amount": 1,
		  "points": 1
		},
		{
		  "id": 5288,
		  "amount": 1,
		  "points": 1
		},
		{
		  "id": 5289,
		  "amount": 1,
		  "points": 1
		},
		{
		  "id": 5315,
		  "amount": 1,
		  "points": 1
		},
		{
		  "id": 5316,
		  "amount": 1,
		  "points": 1
		},
		{
		  "id": 5317,
		  "amount": 1,
		  "points": 1
		}
	  ],
	  "tables": []
	},
	{
	  "name": "Runes",
	  "points": 3,
	  "items": [
		{
		  "id": 556,
		  "min": 71,
		  "max": 80,
		  "points": 3
		},
		{
		  "id": 562,
		  "min": 45,
		  "max": 57,
		  "points": 2
		},
		{
		  "id": 554,
		  "min": 66,
		  "max": 74,
		  "points": 2
		},
		{
		  "id": 560,
		  "min": 22,
		  "max": 24,
		  "points": 2
		}
	  ],
	  "tables": []
	},
	{
	  "name": "Misc",
	  "points": 3,
	  "items": [
		{
		  "id": 995,
		  "min": 100,
		  "max": 6000,
		  "points": 10
		},
		{
		  "id": 13383,
		  "amount": 2,
		  "points": 8
		},
		{
		  "id": 13391,
		  "min": 10,
		  "max": 14,
		  "points": 8
		},
		{
		  "id": 7054,
		  "amount": 2,
		  "points": 5
		},
		{
		  "id": 13392,
		  "amount": 1,
		  "points": 1
		}
	  ],
	  "tables": []
	}
  ]
}