{
  "npcs": [ 7931, 7881 ],
  "guaranteed": [
    { "id": 526, "min": 1, "max": 1, "points": 1 }, //Bones
    { "id": 21820, "min": 1, "max": 5, "points": 1 }, //Ether
    { "id": 13307, "min": 50, "max": 75 } //Blood money
  ],
  "PVPWorld": true,
  "tables": [
    {
      "name": "Unique",
      "points": 1,
      "items": [
        { "id": 13442, "min": 10, "max": 100, "points": 337 }, //Angler fish
        { "id": 10926, "min": 2, "max": 150, "points": 337 }, //Sanfew serum(4)
        { "id": 5953, "min": 2, "max": 75, "points": 336 }, //Antidote++(4) (noted)
        { "id": 12696, "min": 10, "max": 100, "points": 336 }, //Super combat potion(4) (noted)
        { "id": 12626, "min": 1, "max": 25, "points": 336 }, //Stamina potion(noted)
        { "id": 21817, "min": 1, "max": 1, "points": 335 }, //Bracelet of ethereum
        { "id": 21807, "min": 1, "max": 1, "points": 330 }, //Ancient emblem
        { "id": 11840, "min": 1, "max": 1, "points": 151 }, //Dragon boots
        { "id": 4151, "min": 1, "max": 1, "points": 150 }, //Abyssal whip
        { "id": 6585, "min": 1, "max": 1, "points": 150 }, //Amulet of fury
        { "id": 11235, "min": 1, "max": 1, "points": 150 }, //Dark bow
        { "id": 21810, "min": 1, "max": 1, "points": 150 }, //Ancient totem
        { "id": 1187, "min": 1, "max": 1, "points": 155 }, //Dragon sq shield
        { "id": 4585, "min": 1, "max": 1, "points": 155 }, //Dragon skirt
        { "id": 20849, "min": 1, "max": 10, "points": 150 }, //Dragon thrownaxe
        { "id": 21813, "min": 1, "max": 1, "points": 155 }, //Ancient statuette
        { "id": 4153, "min": 1, "max": 1, "points": 110 }, //Granite maul
        { "id": 11941, "min": 1, "max": 1, "points": 110 }, //Looting bag
        { "id": 22299, "min": 1, "max": 1, "points": 110 }, //Ancient medallion
        { "id": 11808, "min": 1, "max": 1, "points": 110 }, //Zamorak godsword
        { "id": 22302, "min": 1, "max": 1, "points": 80 }, //Ancient effigy
        { "id": 21000, "min": 1, "max": 1, "points": 55 }, //Twisted buckler
        { "id": 22305, "min": 1, "max": 1, "points": 55 }, //Ancient relic
        { "id": 22106, "min": 1, "max": 1, "points": 4 } //Jar of decay
      ]
    },
    {
      "name": "Empty",
      "points": 8,
      "items": []
    }
  ]
}
