{
  "npcs": [ 3863 ],
  "guaranteed": [
    { "id": 526, "min": 1, "max": 1 } //Bones
  ],
  "PVPWorld": true,
  "tables": [
    {
      "name": "Other",
      "points": 1,
      "items": [
        { "id": 1025, "min": 1, "max": 1, "points": 1 } //Right eye patch
      ]
    }
  ]
}
