{
  "npcs": [ 1537 ],
  "guaranteed": [
    { "id": 526, "min": 1, "max": 1 } //Bones
  ],
  "PVPWorld": true,
  "tables": [
    {
      "name": "Other",
      "points": 1,
      "items": [
        { "id": 13307, "min": 10, "max": 20, "points": 12 }, //Bloody money
        { "id": 444, "min": 1, "max": 1, "points": 12 }, //Gold ore
        { "id": 2357, "min": 1, "max": 1, "points": 9 }, //Gold bar
        { "id": 1515, "min": 1, "max": 1, "points": 9 }, //Yew logs
        { "id": 1325, "min": 1, "max": 1, "points": 9 }, //Steel scimitar
        { "id": 11371, "min": 1, "max": 1, "points": 6 }, //Steel hasta
        { "id": 11341, "min": 1, "max": 1, "points": 6 }, //Ancient page
        { "id": 1391, "min": 1, "max": 1, "points": 3 }, //Battlestaff
        { "id": 1333, "min": 1, "max": 1, "points": 3 } //Rune scimitar
      ]
    }
  ]
}
