{
  "npcs": [ 3072, 3056, 3059, 3060, 3061, 3064, 3065, 3066, 3067, 3070, 3071, 3068, 3055, 3057, 3058, 3062, 3069 ],
  "guaranteed": [
    { "id": 526, "min": 1, "max": 1 } //Bones
  ],
  "PVPWorld": true,
  "tables": [
    {
      "name": "Weapons",
      "points": 1,
      "items": [
        { "id": 882, "min": 15, "max": 15, "points": 6}, //Bronze arrow
        { "id": 1351, "min": 1, "max": 1, "points": 3 }, //Bronze axe
        { "id": 1375, "min": 1, "max": 1, "points": 3 }, //Bronze battleaxe
        { "id": 1349, "min": 1, "max": 1, "points": 3 }, //Iron axe
        { "id": 1420, "min": 1, "max": 1, "points": 3 }, //Iron mace
        { "id": 1379, "min": 1, "max": 1, "points": 1 }, //Staff
        { "id": 884, "min": 8, "max": 8, "points": 1 } //Iron arrow
      ]
    },
    {
      "name": "Runes",
      "points": 1,
      "items": [
        { "id": 554, "min": 5, "max": 5, "points": 3 }, //Fire rune
        { "id": 558, "min": 4, "max": 4, "points": 3 }, //Mind rune
        { "id": 557, "min": 2, "max": 2, "points": 3 }, //Earth rune
        { "id": 562, "min": 2, "max": 2, "points": 3 }, //Chaos rune
        { "id": 562, "min": 3, "max": 3, "points": 1 }, //Chaos rune
        { "id": 563, "min": 2, "max": 2, "points": 1 } //Law rune
      ]
    },
    {
      "name": "Other",
      "points": 1,
      "items": [
        { "id": 13307, "min": 5, "max": 10, "points": 9 }, //Blood money
        { "id": 438, "min": 1, "max": 1, "points": 6 }, //Tin ore
        { "id": 440, "min": 1, "max": 1, "points": 6 }, //Iron ore
        { "id": 948, "min": 1, "max": 1, "points": 6 }, //Bear fur
        { "id": 1917, "min": 1, "max": 1, "points": 6 }, //Beer
        { "id": 2142, "min": 1, "max": 1, "points": 6 }, //Cooked meat
        { "id": 1592, "min": 1, "max": 1, "points": 6 }, //Ring mould
        { "id": 1595, "min": 1, "max": 1, "points": 6}, //Amulet mould
        { "id": 956, "min": 1, "max": 1, "points": 3}, //Flier
        { "id": 1623, "min": 1, "max": 1, "points": 3 }, //Uncut sapphire
        { "id": 1621, "min": 1, "max": 1, "points": 3 }, //Uncut emerald
        { "id": 1617, "min": 1, "max": 1, "points": 1 }, //Uncut diamond
        { "id": 1462, "min": 1, "max": 1, "points": 1 } //Nature talisman
      ]
    }
  ]
}
