{
  "npcs": [ 3015, 3083, 3084, 3085, 3110, 3267, 3268, 6990, 6991, 6992 ],
  "guaranteed": [
    { "id": 526, "min": 1, "max": 1 } //Bones
  ],
  "PVPWorld": true,
  "tables": [
    {
      "name": "Runes",
      "points": 1,
      "items": [
        { "id": 557, "min": 4, "max": 4, "points": 6 }, //Earth rune
        { "id": 554, "min": 6, "max": 6, "points": 6 }, //Fire rune
        { "id": 558, "min": 9, "max": 9, "points": 6 }, //Mind rune
        { "id": 562, "min": 2, "max": 2, "points": 1 } //Chaos rune
      ]
    },
    {
      "name": "Herbs (m)",
      "points": 1,
      "items": [
        { "id": 199, "min": 1, "max": 1, "points": 9 }, //Grimy guam leaf
        { "id": 201, "min": 1, "max": 1, "points": 6 }, //Grimy marrentill
        { "id": 203, "min": 1, "max": 1, "points": 6 }, //Grimy tarromin
        { "id": 205, "min": 1, "max": 1, "points": 6 }, //Grimy harralander
        { "id": 207, "min": 1, "max": 1, "points": 6 }, //Grimy ranarr weed
        { "id": 213, "min": 1, "max": 1, "points": 6 }, //Grimy kwuarm
        { "id": 209, "min": 1, "max": 1, "points": 6 }, //Grimy irit leaf
        { "id": 211, "min": 1, "max": 1, "points": 6 }, //Grimy avantoe
        { "id": 215, "min": 1, "max": 1, "points": 1 }, //Grimy cadantine
        { "id": 217, "min": 1, "max": 1, "points": 1 }, //Grimy dwarf weed
        { "id": 2485, "min": 1, "max": 1, "points": 1 } //Grimy lantadyme
      ]
    },
    {
      "name": "Weapons and armour",
      "points": 1,
      "items": [
        { "id": 877, "min": 2, "max": 12, "points": 6 }, //Bronze bolts
        { "id": 882, "min": 7, "max": 7, "points": 6 }, //Bronze arrow
        { "id": 1203, "min": 1, "max": 1, "points": 1 }, //Iron dagger
        { "id": 1139, "min": 1, "max": 1, "points": 1 } //Bronze med helm
      ]
    },
    {
      "name": "Other",
      "points": 1,
      "items": [
        { "id": 995, "min": 1, "max": 5, "points": 9 }, //Blood money
        { "id": 313, "min": 1, "max": 1, "points": 3 }, //Fishing bait
        { "id": 1440, "min": 1, "max": 1, "points": 3 }, //Earth talisman
        { "id": 1965, "min": 1, "max": 1, "points": 3 }, //Cabbage
        { "id": 436, "min": 1, "max": 1, "points": 3 } //Copper ore
      ]
    }
  ]
}
