{
  "Wilderness": [
    {
      "name": "General",
      "teleports": [
        { "name": "Magebank", "x": 2539, "y": 4716, "z": 0 },
        { "name": "Chaos Temple|<col=FF0000>Level 15|<img=14> <img=65>", "x": 3236, "y": 3638, "z": 0 },   
        { "name": "East Dragons|<col=FF0000>Level 19|<img=65>", "x": 3364, "y": 3666, "z": 0 },
        { "name": "West Dragons|<col=FF0000>Level 10|<img=65>", "x": 2983, "y": 3598, "z": 0 },
        { "name": "Demonic Ruins|<col=FF0000>Level 46|<img=14> <img=65>", "x": 3287, "y": 3886, "z": 0 },
        { "name": "Graveyard|<col=FF0000>Level 20|<img=65>", "x": 3160, "y": 3676, "z": 0 },
        { "name": "Revenant Cave|<col=FF0000>Level 17|<img=14> <img=65>", "x": 3069, "y": 3651, "z": 0 },
        { "name": "Revenant Cave|<col=FF0000>Level 39|<img=65>", "x": 3131, "y": 3830, "z": 0 },
        { "name": "Chaos Temple|<col=FF0000>Level 15|<img=14> <img=65>", "x": 3236, "y": 3638, "z": 0 }
      ]
    },
    {
      "name": "Obelisks",
      "teleports": [
        { "name": "Obelisk|<col=FF0000>Level 13|<img=14> <img=65>", "x": 3144, "y": 3622, "z": 0 },
        { "name": "Obelisk|<col=FF0000>Level 19|<img=14> <img=65>", "x": 3211, "y": 3664, "z": 0 },   
        { "name": "Obelisk|<col=FF0000>Level 35|<img=65>", "x": 3097, "y": 3799, "z": 0 },
        { "name": "Obelisk|<col=FF0000>Level 44|<img=65>", "x": 2979, "y": 3871, "z": 0 },   
        { "name": "Obelisk|<col=FF0000>Level 50|<img=65>", "x": 3307, "y": 3916, "z": 0 }
      ]
    }
  ],
  "Monsters": [
    {
      "name": "Free",
      "teleports": [
        { "name": "Abyssal Sire|<img=14>", "x": 3038, "y": 4771, "z": 0 },
        { "name": "Cave Kraken", "x": 2286, "y": 10013, "z": 0 },
        { "name": "Cerberus", "x": 1315, "y": 1251, "z": 0 },
        { "name": "Corporeal Beast|<img=14>", "x": 2967, "y": 4383, "z": 2},
        { "name": "Dagannoth's Lair|<img=14>", "x": 1913, "y": 4367, "z": 0 },
        { "name": "Godwars Dungeon|<img=14>", "x": 2882, "y": 5311, "z": 2 },
        { "name": "Kalphite Queen|<img=14>", "x": 3504, "y": 9494, "z": 0 },
        { "name": "Lizardman Shaman|<img=14>", "x": 1453, "y": 3695, "z": 0 },
        { "name": "Thermonuclear Smoke Devil|<img=14>", "x": 2376, "y": 9452, "z": 0 },
        { "name": "Zulrah", "x": 2201, "y": 3057, "z": 0 }
      ]
    },
    {
      "name": "Paid",
      "teleports": [
        { "name": "Callisto|<col=FF0000>100 bm|<img=64> <img=65>", "x": 3295, "y": 3841, "z": 0, "price": 100},
        { "name": "Chaos Elemental|<col=FF0000>100 bm|<img=64> <img=65>", "x": 3242, "y": 3915, "z": 0, "price": 100},
        { "name": "Chaos Fanatic|<col=FF0000>100 bm|<img=64> <img=65>", "x": 2984, "y": 3831, "z": 0, "price": 100},
        { "name": "Lava Dragons|<col=FF0000>100 bm|<img=64> <img=65>", "x": 3202, "y": 3859, "z": 0, "price": 100},
        { "name": "Scorpia|<col=FF0000>100 bm|<img=64> <img=65>", "x": 3236, "y": 3946, "z": 0, "price": 100},
        { "name": "Venenatis|<col=FF0000>100 bm|<img=64> <img=65>", "x": 3345, "y": 3728, "z": 0, "price": 100},
        { "name": "Vet'ion|<col=FF0000>100 bm|<img=64> <img=65>", "x": 3222, "y": 3799, "z": 0, "price": 100},
        { "name": "Gorillas|<col=FF0000>100 bm|<img=64> <img=65>", "x": 2018, "y": 5600, "z": 0, "price": 100}
      ]
    }
  ],
  "Minigames": [
    {
      "name": "General",
      "teleports": [
        { "name": "Barrows", "x": 3565, "y": 3313, "z": 0 },
        { "name": "Duel Arena", "x": 3366, "y": 3267, "z": 0 },
        { "name": "Fight Caves", "x": 2443, "y": 5171, "z": 0 },
        { "name": "Inferno", "x": 2496, "y": 5113, "z": 0 },
        { "name": "Warriors' Guild", "x": 2842, "y": 3540, "z": 2 }
      ]
    }
  ]
}
