{
  "npcs": [ 3600 ],
  "guaranteed": [
    { "id": 526, "min": 1, "max": 1 }, //Bones
    { "id": 5001, "min": 5, "max": 10 } //Raw cave eel
  ],
  "PVPWorld": true,
  "tables": [
    {
      "name": "Other",
      "points": 1,
      "items": [
        { "id": 10877, "min": 1, "max": 1, "points": 1 }, //Plain satchel
        { "id": 10859, "min": 1, "max": 1, "points": 1 } //Tea flask
      ]
    }
  ]
}
