{
  "npcs": [ 1286 ],
  "PVPWorld": true,
  "tables": [
    {
      "name": "Drops",
      "points": 1,
      "items": [
        { "id": 3404, "min": 1, "max": 1, "points": 1 } //Fiyr remains
      ]
    }
  ]
}
