{
  "npcs": [ 2207 ],
  "guaranteed": [
    { "id": 526, "min": 1, "max": 1 }, //Bones
    { "id": 13307, "min": 25, "max": 50 } //Blood money
  ],
  "PVPWorld": true,
  "tables": [
    {
      "name": "Unique",
      "points": 1,
      "items": [
        { "id": 13307, "min": 20, "max": 50, "points": 12 }, //Blood money
        { "id": 11937, "min": 5, "max": 10, "points": 12 }, //Dark crab
        { "id": 10926, "min": 2, "max": 10, "points": 12 }, //Sanfew serum(4)
        { "id": 5953, "min": 2, "max": 10, "points": 12 }, //Antidote++(4) (noted)
        { "id": 12696, "min": 2, "max": 10, "points": 12 }, //Super combat potion(4) (noted)
        { "id": 11818, "min": 1, "max": 1, "points": 6 }, //Godsword shard 1
        { "id": 11820, "min": 1, "max": 1, "points": 6 }, //Godsword shard 2
        { "id": 11822, "min": 1, "max": 1, "points": 6 }, //Godsword shard 3
        { "id": 11838, "min": 1, "max": 1, "points": 1 } //Saradomin sword
      ]
    },
    {
      "name": "Empty",
      "points": 6,
      "items": []
    }
  ]
}
