{
  "npcs": [ 7150, 7151, 7153, 7095, 7096, 7097 ],
  "guaranteed": [
    { "id": 592, "min": 1, "max": 1 }, //Ashes
    { "id": 13307, "min": 120, "max": 200 } //Blood money
  ],
  "PVPWorld": true,
  "tables": [
    {
      "name": "Unique",
      "points": 1,
      "items": [
        { "id": 13307, "min": 300, "max": 450, "points": 12 }, //Blood money
        { "id": 11937, "min": 5, "max": 6, "points": 12 }, //Dark crab
        { "id": 10926, "min": 2, "max": 6, "points": 12 }, //Sanfew serum(4)
        { "id": 5953, "min": 2, "max": 6, "points": 12 }, //Antidote++(4) (noted)
        { "id": 12696, "min": 2, "max": 6, "points": 12 }, //Super combat potion(4) (noted)
        { "id": 19484, "min": 3, "max": 7, "points": 4}, //Dragon javelins
        { "id": 19478, "min": 1, "max": 1, "points": 1 }, //Light ballista
        { "id": 19481, "min": 1, "max": 1, "points": 1 }, //Heavy ballista
        { "id": 19547, "min": 1, "max": 1, "points": 1 }, //Necklace of anguish
        { "id": 19544, "min": 1, "max": 1, "points": 1 }, //Tormented bracelet
        { "id": 19550, "min": 1, "max": 1, "points": 1 }, //Ring of suffering
        { "id": 19553, "min": 1, "max": 1, "points": 1 } //Amulet of torture
      ]
    },
    {
      "name": "Empty",
      "points": 6,
      "items": [ ]
    }
  ]
}
