{
  "npcs": [ 481, 483 ],
  "PVPWorld": true,
  "tables": [
    {
      "name": "Weapons",
      "points": 1,
      "items": [
        { "id": 1395, "min": 1, "max": 1, "points": 1 } //Water battlestaff
      ]
    },
    {
      "name": "Herbs",
      "points": 1,
      "items": [
        { "id": 199, "min": 1, "max": 1, "points": 1 }, //Grimy guam leaf
        { "id": 201, "min": 1, "max": 1, "points": 1 }, //Grimy marrentill
        { "id": 203, "min": 1, "max": 1, "points": 1 }, //Grimy tarromin
        { "id": 205, "min": 1, "max": 1, "points": 1 }, //Grimy harralander
        { "id": 207, "min": 1, "max": 1, "points": 1 }, //Grimy ranarr weed
        { "id": 209, "min": 1, "max": 1, "points": 1 }, //Grimy irit leaf
        { "id": 211, "min": 1, "max": 1, "points": 1 }, //Grimy avantoe
        { "id": 213, "min": 1, "max": 1, "points": 1 }, //Grimy kwuarm
        { "id": 215, "min": 1, "max": 1, "points": 1 }, //Grimy cadantine
        { "id": 2485, "min": 1, "max": 1, "points": 1 }, //Grimy lantadyme
        { "id": 217, "min": 1, "max": 1, "points": 1 } //Grimy dwarf weed
      ]
    },
    {
      "name": "Runes",
      "points": 1,
      "items": [
        { "id": 557, "min": 6, "max": 6, "points": 1 }, //Earth rune
        { "id": 555, "min": 8, "max": 8, "points": 1 }, //Water rune
        { "id": 561, "min": 1, "max": 2, "points": 1 } //Nature rune
      ]
    },
    {
      "name": "Other",
      "points": 1,
      "items": [
        { "id": 13307, "min": 10, "max": 20, "points": 1 }, //Blood money
        { "id": 590, "min": 1, "max": 1, "points": 1 }, //Tinderbox
        { "id": 235, "min": 1, "max": 1, "points": 1 }, //Unicorn horn dust
        { "id": 10978, "min": 1, "max": 1, "points": 1 }, //Swamp weed
        { "id": 10978, "min": 3, "max": 3, "points": 1 }, //Swamp weed
        { "id": 221, "min": 1, "max": 1, "points": 1 }, //Eye of newt
        { "id": 225, "min": 1, "max": 1, "points": 1 }, //Limpwurt root
        { "id": 231, "min": 1, "max": 1, "points": 1 }, //Snape grass
        { "id": 223, "min": 1, "max": 1, "points": 1 }, //Red spiders' eggs
        { "id": 4529, "min": 1, "max": 1, "points": 1 }, //Candle lantern
        { "id": 36, "min": 1, "max": 1, "points": 1 } //Candle
      ]
    }
  ]
}
