{
  "npcs": [ 955, 956, 961 ],
  "PVPWorld": true,
  "tables": [
    {
      "name": "Weapon/Armour",
      "points": 1,
      "items": [
        { "id": 1279, "min": 1, "max": 1, "points": 9 }, //Iron sword
        { "id": 826, "min": 5, "max": 5, "points": 6 }, //Iron javelin
        { "id": 1207, "min": 1, "max": 1, "points": 3 }, //Steel dagger
        { "id": 1295, "min": 1, "max": 1, "points": 3 }, //Steel longsword
        { "id": 1131, "min": 1, "max": 1, "points": 1 } //Hardleather body
      ]
    },
    {
      "name": "Runes",
      "points": 1,
      "items": [
        { "id": 559, "min": 2, "max": 2, "points": 9 }, //Body rune
        { "id": 559, "min": 6, "max": 6, "points": 6 }, //Body rune
        { "id": 564, "min": 2, "max": 2, "points": 6 }, //Cosmic rune
        { "id": 562, "min": 3, "max": 3, "points": 6 }, //Chaos rune
        { "id": 560, "min": 3, "max": 3, "points": 3 }, //Death rune
        { "id": 554, "min": 7, "max": 7, "points": 3 }, //Fire rune
        { "id": 555, "min": 2, "max": 2, "points": 3 }, //Water rune
        { "id": 563, "min": 2, "max": 2, "points": 1 }, //Law rune
        { "id": 561, "min": 4, "max": 4, "points": 1 } //Nature rune
      ]
    },
    {
      "name": "Herbs",
      "points": 1,
      "items": [
        { "id": 199, "min": 1, "max": 1, "points": 9 }, //Grimy guam leaf
        { "id": 201, "min": 1, "max": 1, "points": 9 }, //Grimy marrentill
        { "id": 203, "min": 1, "max": 1, "points": 6 }, //Grimy tarromin
        { "id": 205, "min": 1, "max": 1, "points": 6 }, //Grimy harralander
        { "id": 207, "min": 1, "max": 1, "points": 6 }, //Grimy ranarr weed
        { "id": 209, "min": 1, "max": 1, "points": 3 }, //Grimy irit leaf
        { "id": 211, "min": 1, "max": 1, "points": 3 }, //Grimy avantoe
        { "id": 213, "min": 1, "max": 1, "points": 3 }, //Grimy kwuarm
        { "id": 215, "min": 1, "max": 1, "points": 1 }, //Grimy cadantine
        { "id": 2485, "min": 1, "max": 1, "points": 1 }, //Grimy lantadyme
        { "id": 217, "min": 1, "max": 1, "points": 1 } //Grimy dwarf weed
      ]
    },
    {
      "name": "Other",
      "points": 1,
      "items": [
        { "id": 13307, "min": 1, "max": 1, "points": 9 }, //Blood money
        { "id": 1823, "min": 1, "max": 1, "points": 3 }, //Waterskin(4)
        { "id": 1623, "min": 1, "max": 1, "points": 3 }, //Uncut sapphire
        { "id": 13490, "min": 1, "max": 1, "points": 1 } //Ensouled kalphite head
      ]
    }
  ]
}
