{
  "points": 0,
  "items": [],
  "npcs": [
	465,
	466,
	467,
	468
  ],
  "guaranteed": [
	{
	  "id": 6812
	}
  ],
  "tables": [
	{
	  "name": "Weapons",
	  "points": 2,
	  "items": [
		{
		  "id": 1399,
		  "amount": 1,
		  "points": 7
		},
		{
		  "id": 1359,
		  "amount": 1,
		  "points": 7
		},
		{
		  "id": 1373,
		  "amount": 1,
		  "points": 7
		},
		{
		  "id": 1347,
		  "amount": 1,
		  "points": 7
		},
		{
		  "id": 1201,
		  "amount": 1,
		  "points": 7
		},
		{
		  "id": 1163,
		  "amount": 1,
		  "points": 7
		},
		{
		  "id": 4087,
		  "amount": 1,
		  "points": 1
		},
		{
		  "id": 4585,
		  "amount": 1,
		  "points": 1
		},
		{
		  "id": 6809,
		  "amount": 1,
		  "points": 1
		}
	  ],
	  "tables": []
	},
	{
	  "name": "Runes",
	  "points": 3,
	  "items": [
		{
		  "id": 7937,
		  "amount": 250,
		  "points": 3
		},
		{
		  "id": 556,
		  "amount": 225,
		  "points": 3
		},
		{
		  "id": 555,
		  "amount": 150,
		  "points": 3
		},
		{
		  "id": 562,
		  "amount": 80,
		  "points": 2
		},
		{
		  "id": 563,
		  "amount": 45,
		  "points": 2
		},
		{
		  "id": 560,
		  "amount": 40,
		  "points": 2
		},
		{
		  "id": 565,
		  "amount": 25,
		  "points": 2
		},
		{
		  "id": 566,
		  "amount": 20,
		  "points": 1
		}
	  ],
	  "tables": []
	},
	{
	  "name": "Ammo",
	  "points": 2,
	  "items": [
		{
		  "id": 9143,
		  "min": 7,
		  "max": 99,
		  "points": 2
		},
		{
		  "id": 9144,
		  "min": 5,
		  "max": 44,
		  "points": 1
		},
		{
		  "id": 892,
		  "amount": 36,
		  "points": 1
		}
	  ],
	  "tables": []
	},
	{
	  "name": "Seeds",
	  "points": 1,
	  "items": [
		{
		  "id": 5295,
		  "amount": 3,
		  "points": 1
		},
		{
		  "id": 5300,
		  "amount": 1,
		  "points": 1
		}
	  ],
	  "tables": []
	},
	{
	  "name": "Herbs",
	  "points": 3,
	  "items": [
		{
		  "id": 199,
		  "min": 1,
		  "max": 3,
		  "points": 2
		},
		{
		  "id": 201,
		  "min": 1,
		  "max": 3,
		  "points": 2
		},
		{
		  "id": 203,
		  "min": 1,
		  "max": 3,
		  "points": 2
		},
		{
		  "id": 205,
		  "min": 1,
		  "max": 3,
		  "points": 2
		},
		{
		  "id": 207,
		  "min": 1,
		  "max": 3,
		  "points": 1
		},
		{
		  "id": 209,
		  "min": 1,
		  "max": 3,
		  "points": 1
		},
		{
		  "id": 211,
		  "min": 1,
		  "max": 3,
		  "points": 1
		},
		{
		  "id": 213,
		  "min": 1,
		  "max": 3,
		  "points": 1
		}
	  ],
	  "tables": []
	},
	{
	  "name": "Materials",
	  "points": 2,
	  "items": [
		{
		  "id": 1514,
		  "amount": 35,
		  "points": 1
		},
		{
		  "id": 2362,
		  "amount": 10,
		  "points": 1
		},
		{
		  "id": 568,
		  "amount": 75,
		  "points": 1
		},
		{
		  "id": 441,
		  "amount": 200,
		  "points": 1
		},
		{
		  "id": 1620,
		  "amount": 10,
		  "points": 1
		},
		{
		  "id": 1618,
		  "amount": 5,
		  "points": 1
		},
		{
		  "id": 1392,
		  "amount": 10,
		  "points": 1
		}
	  ],
	  "tables": []
	},
	{
	  "name": "Others",
	  "points": 3,
	  "items": [
		{
		  "id": 995,
		  "amount": 300,
		  "points": 500
		},
		{
		  "id": 2434,
		  "amount": 2,
		  "points": 200
		},
		{
		  "id": 379,
		  "amount": 6,
		  "points": 200
		},
		{
		  "id": 9465,
		  "amount": 1,
		  "points": 200
		},
		{
		  "id": 11286,
		  "amount": 1,
		  "points": 2
		}
	  ],
	  "tables": []
	}
  ]
}