{
  "npcs": [ 2098, 2099, 2100, 2101, 2102, 2103, 7261 ],
  "guaranteed": [
    { "id": 532, "min": 1, "max": 1 } //Big bones
  ],
  "PVPWorld": true,
  "tables": [
    {
      "name": "Weapons/Armour",
      "points": 1,
      "items": [
        { "id": 884, "min": 3, "max": 3, "points": 12 }, //Iron arrow
        { "id": 1203, "min": 1, "max": 1, "points": 9 }, //Iron dagger
        { "id": 1153, "min": 1, "max": 1, "points": 9 }, //Iron full helm
        { "id": 1191, "min": 1, "max": 1, "points": 6 }, //Iron kiteshield
        { "id": 1295, "min": 1, "max": 1, "points": 6 }, //Steel longsword
        { "id": 886, "min": 10, "max": 10, "points": 6 }, //Steel arrow
        { "id": 1207, "min": 1, "max": 1, "points": 3 }, //Steel dagger
        { "id": 1309, "min": 1, "max": 1, "points": 3 }, //Iron 2h sword
        { "id": 1119, "min": 1, "max": 1, "points": 1 }, //Steel platebody
        { "id": 888, "min": 3, "max": 3, "points": 1 }, //Mithril arrow
        { "id": 890, "min": 1, "max": 5, "points": 1 } //Adamant arrow
      ]
    },
    {
      "name": "Runes",
      "points": 1,
      "items": [
        { "id": 555, "min": 7, "max": 7, "points": 9 }, //Water rune
        { "id": 564, "min": 2, "max": 2, "points": 9 }, //Cosmic rune
        { "id": 554, "min": 15, "max": 15, "points": 6 }, //Fire rune
        { "id": 558, "min": 3, "max": 3, "points": 6 }, //Mind rune
        { "id": 561, "min": 6, "max": 6, "points": 3 }, //Nature rune
        { "id": 563, "min": 2, "max": 2, "points": 3 }, //Law rune
        { "id": 562, "min": 2, "max": 2, "points": 3 }, //Chaos rune
        { "id": 560, "min": 2, "max": 2, "points": 1 } //Death rune
      ]
    },
    {
      "name": "Herbs (members only)",
      "points": 1,
      "items": [
        { "id": 199, "min": 1, "max": 1, "points": 6 }, //Grimy guam leaf
        { "id": 201, "min": 1, "max": 1, "points": 6 }, //Grimy marrentill
        { "id": 203, "min": 1, "max": 1, "points": 6 }, //Grimy tarromin
        { "id": 205, "min": 1, "max": 1, "points": 6 }, //Grimy harralander
        { "id": 207, "min": 1, "max": 1, "points": 6 }, //Grimy ranarr weed
        { "id": 209, "min": 1, "max": 1, "points": 6 }, //Grimy irit leaf
        { "id": 211, "min": 1, "max": 1, "points": 3 }, //Grimy avantoe
        { "id": 213, "min": 1, "max": 1, "points": 3 }, //Grimy kwuarm
        { "id": 215, "min": 1, "max": 1, "points": 1 }, //Grimy cadantine
        { "id": 2485, "min": 1, "max": 1, "points": 1 }, //Grimy lantadyme
        { "id": 217, "min": 1, "max": 1, "points": 1 } //Grimy dwarf weed
      ]
    },
    {
      "name": "Seeds (members only)",
      "points": 1,
      "items": [
        { "id": 5318, "min": 4, "max": 4, "points": 3 }, //Potato seed
        { "id": 5319, "min": 4, "max": 4, "points": 3 }, //Onion seed
        { "id": 5322, "min": 1, "max": 3, "points": 3 }, //Tomato seed
        { "id": 5324, "min": 4, "max": 4, "points": 3 }, //Cabbage seed
        { "id": 5323, "min": 2, "max": 2, "points": 3 }, //Strawberry seed
        { "id": 5320, "min": 3, "max": 3, "points": 3 }, //Sweetcorn seed
        { "id": 5100, "min": 1, "max": 1, "points": 3 }, //Limpwurt seed
        { "id": 5321, "min": 1, "max": 4, "points": 1 } //Watermelon seed
      ]
    },
    {
      "name": "Other",
      "points": 1,
      "items": [
        { "id": 13307, "min": 1, "max": 8, "points": 12 }, //Blood money
        { "id": 225, "min": 1, "max": 1, "points": 1 }, //Limpwurt root
        { "id": 1917, "min": 1, "max": 1, "points": 1 }, //Beer
        { "id": 1446, "min": 1, "max": 1, "points": 1 }, //Body talisman
        { "id": 13475, "min": 1, "max": 1, "points": 1 } //Ensouled giant head
      ]
    }
  ]
}
