{
  "npcs": [ 136, 2095, 2096, 2233, 1153 ],
  "guaranteed": [
    { "id": 532, "min": 1, "max": 1 } //Big bones
  ],
  "PVPWorld": true,
  "tables": [
    {
      "name": "Seeds",
      "points": 25,
      "items": [
        { "id": 5100, "min": 1, "max": 1, "points": 12 }, //Limpwurt seed
        { "id": 5323, "min": 1, "max": 1, "points": 12 }, //Strawberry seed
        { "id": 5280, "min": 1, "max": 1, "points": 12 }, //Cactus seed
        { "id": 5311, "min": 1, "max": 1, "points": 9 }, //Wildblood seed
        { "id": 5105, "min": 1, "max": 1, "points": 9 }, //Whiteberry seed
        { "id": 5104, "min": 1, "max": 1, "points": 9 }, //Jangerberry seed
        { "id": 5106, "min": 1, "max": 1, "points": 9 }, //Poison ivy seed
        { "id": 5292, "min": 1, "max": 1, "points": 9 }, //Marrentill seed
        { "id": 5297, "min": 1, "max": 1, "points": 6 }, //Irit seed
        { "id": 5298, "min": 1, "max": 1, "points": 6 }, //Avantoe seed
        { "id": 5301, "min": 1, "max": 1, "points": 6 }, //Cadantine seed
        { "id": 5294, "min": 1, "max": 1, "points": 6 }, //Harralander seed
        { "id": 5282, "min": 1, "max": 1, "points": 6 }, //Mushroom spore
        { "id": 5295, "min": 1, "max": 1, "points": 3 }, //Ranarr seed
        { "id": 5293, "min": 1, "max": 1, "points": 3 }, //Tarromin seed
        { "id": 5296, "min": 1, "max": 1, "points": 3 }, //Toadflax seed
        { "id": 5299, "min": 1, "max": 1, "points": 3 }, //Kwuarm seed
        { "id": 5304, "min": 1, "max": 1, "points": 3 }, //Torstol seed
        { "id": 5300, "min": 1, "max": 1, "points": 3 }, //Snapdragon seed
        { "id": 5321, "min": 1, "max": 1, "points": 3 }, //Watermelon seed
        { "id": 5302, "min": 1, "max": 1, "points": 3 }, //Lantadyme seed
        { "id": 5281, "min": 1, "max": 1, "points": 1 }, //Belladonna seed
        { "id": 5303, "min": 1, "max": 1, "points": 1 } //Dwarf weed seed
      ]
    },
    {
      "name": "Other",
      "points": 1,
      "items": [
        { "id": 13478, "min": 1, "max": 1, "points": 1 } //Ensouled ogre head
      ]
    }
  ]
}
