{
  "npcs": [ 4822, 4819 ],
  "guaranteed": [
    { "id": 7518, "min": 1, "max": 1 } //Crab meat
  ],
  "PVPWorld": true,
  "tables": [
    {
      "name": "Other",
      "points": 1,
      "items": [
        { "id": 7536, "min": 1, "max": 1, "points": 12 }, //Fresh crab claw
        { "id": 7538, "min": 1, "max": 1, "points": 12 }, //Fresh crab shell
        { "id": 407, "min": 1, "max": 2, "points": 1 } //Oyster
      ]
    }
  ]
}
