{
  "npcs": [ 1097 ],
  "PVPWorld": true,
  "guaranteed": [
    { "id": 532, "min": 1, "max": 1 } //Big bones
  ],
  "tables": [
    {
      "name": "Seeds",
      "points": 1,
      "items": [
        { "id": 5311, "min": 1, "max": 1, "points": 12 }, //Wildblood seed
        { "id": 5292, "min": 1, "max": 1, "points": 12 }, //Marrentill seed
        { "id": 5100, "min": 1, "max": 1, "points": 9 }, //Limpwurt seed
        { "id": 5323, "min": 1, "max": 1, "points": 9 }, //Strawberry seed
        { "id": 5105, "min": 1, "max": 1, "points": 9 }, //Whiteberry seed
        { "id": 5104, "min": 1, "max": 1, "points": 9 }, //Jangerberry seed
        { "id": 5281, "min": 1, "max": 1, "points": 9 }, //Belladonna seed
        { "id": 5291, "min": 1, "max": 1, "points": 6 }, //Guam seed
        { "id": 5293, "min": 1, "max": 1, "points": 6 }, //Tarromin seed
        { "id": 5294, "min": 1, "max": 1, "points": 6 }, //Harralander seed
        { "id": 5296, "min": 1, "max": 1, "points": 6 }, //Toadflax seed
        { "id": 5297, "min": 1, "max": 1, "points": 6 }, //Irit seed
        { "id": 5299, "min": 1, "max": 1, "points": 6 }, //Kwuarm seed
        { "id": 5321, "min": 1, "max": 1, "points": 3 }, //Watermelon seed
        { "id": 5106, "min": 1, "max": 1, "points": 3 }, //Poison ivy seed
        { "id": 5295, "min": 1, "max": 1, "points": 3 }, //Ranarr seed
        { "id": 5298, "min": 1, "max": 1, "points": 3 }, //Avantoe seed
        { "id": 5301, "min": 1, "max": 1, "points": 3 }, //Cadantine seed
        { "id": 5302, "min": 1, "max": 1, "points": 3 }, //Lantadyme seed
        { "id": 5303, "min": 1, "max": 1, "points": 3 }, //Dwarf weed seed
        { "id": 5304, "min": 1, "max": 1, "points": 1 }, //Torstol seed
        { "id": 5300, "min": 1, "max": 1, "points": 1 } //Snapdragon seed
      ]
    },
    {
      "name": "Herbs",
      "points": 1,
      "items": [
        { "id": 199, "min": 1, "max": 1, "points": 9 }, //Grimy guam leaf
        { "id": 201, "min": 1, "max": 1, "points": 9 }, //Grimy marrentill
        { "id": 203, "min": 1, "max": 1, "points": 9 }, //Grimy tarromin
        { "id": 205, "min": 1, "max": 1, "points": 6 }, //Grimy harralander
        { "id": 209, "min": 1, "max": 1, "points": 6 }, //Grimy irit leaf
        { "id": 211, "min": 1, "max": 1, "points": 6 }, //Grimy avantoe
        { "id": 207, "min": 1, "max": 1, "points": 3 }, //Grimy ranarr weed
        { "id": 213, "min": 1, "max": 1, "points": 3 }, //Grimy kwuarm
        { "id": 215, "min": 1, "max": 1, "points": 3 }, //Grimy cadantine
        { "id": 2485, "min": 1, "max": 1, "points": 1 }, //Grimy lantadyme
        { "id": 217, "min": 1, "max": 1, "points": 1 } //Grimy dwarf weed
      ]
    },
    {
      "name": "Runes and Talismans",
      "points": 1,
      "items": [
        { "id": 4695, "min": 1, "max": 1, "points": 3 }, //Mist rune
        { "id": 555, "min": 15, "max": 15, "points": 3 }, //Water rune
        { "id": 1452, "min": 1, "max": 3, "points": 1 } //Chaos talisman
      ]
    },
    {
      "name": "Other",
      "points": 1,
      "items": [
        { "id": 13307, "min": 10, "max": 20, "points": 12 }, //Bloody money
        { "id": 46, "min": 1, "max": 1, "points": 9 }, //Pearl bolt tips
        { "id": 46, "min": 3, "max": 3, "points": 9 }, //Pearl bolt tips
        { "id": 411, "min": 2, "max": 2, "points": 9 }, //Oyster pearl
        { "id": 571, "min": 1, "max": 1, "points": 9 }, //Water orb
        { "id": 401, "min": 5, "max": 5, "points": 6 }, //Seaweed
        { "id": 403, "min": 5, "max": 5, "points": 6 }, //Edible seaweed
        { "id": 377, "min": 1, "max": 1, "points": 6 }, //Raw lobster
        { "id": 363, "min": 2, "max": 2, "points": 6 }, //Raw bass
        { "id": 823, "min": 2, "max": 2, "points": 6 }, //Adamant dart tip
        { "id": 4160, "min": 1, "max": 1, "points": 3 }, //Broad arrows
        { "id": 4160, "min": 4, "max": 4, "points": 3 }, //Broad arrows
        { "id": 405, "min": 1, "max": 1, "points": 3 }, //Casket
        { "id": 313, "min": 50, "max": 50, "points": 1 }, //Fishing bait
        { "id": 413, "min": 1, "max": 1, "points": 1 } //Oyster pearls
      ]
    }
  ]
}
