{
  "npcs": [ 3692, 3693, 4436, 4437, 4438 ],
  "PVPWorld": true,
  "tables": [
    {
      "name": "Drops",
      "points": 1,
      "items": [
        { "id": 3325, "min": 1, "max": 1, "points": 1 } //Vampire dust
      ]
    }
  ]
}
