{
  "npcs": [ 4820, 4821 ],
  "guaranteed": [
    { "id": 7532, "min": 1, "max": 1 } //Mudskipper hide
  ],
  "PVPWorld": true,
  "tables": [
    {
      "name": "Other",
      "points": 1,
      "items": [
        { "id": 407, "min": 1, "max": 1, "points": 1 } //Oyster
      ]
    }
  ]
}
