{
  "npcs": [ 2144, 478 ],
  "guaranteed": [
    { "id": 526, "min": 1, "max": 1 }, //Bones
    { "id": 526, "min": 2, "max": 2 } //Bones
  ],
  "PVPWorld": true,
  "tables": [
    {
      "name": "Runes and talismans",
      "points": 1,
      "items": [
        { "id": 555, "min": 12, "max": 12, "points": 6 }, //Water rune
        { "id": 557, "min": 12, "max": 12, "points": 6 }, //Earth rune
        { "id": 564, "min": 2, "max": 2, "points": 3 }, //Cosmic rune
        { "id": 561, "min": 4, "max": 4, "points": 3 }, //Nature rune
        { "id": 1440, "min": 1, "max": 1, "points": 3 }, //Earth talisman
        { "id": 1444, "min": 1, "max": 1, "points": 1 } //Water talisman
      ]
    },
    {
      "name": "Other",
      "points": 1,
      "items": [
        { "id": 13307, "min": 5, "max": 10, "points": 1 } //Blood money
      ]
    }
  ]
}
