{
  "npcs": [ 1 ],
  "PVPWorld": true,
  "tables": [
    {
      "name": "Herbs",
      "points": 1,
      "items": [
        { "id": 199, "min": 1, "max": 1, "points": 9 }, //Grimy guam leaf
        { "id": 201, "min": 1, "max": 1, "points": 9 }, //Grimy marrentill
        { "id": 203, "min": 1, "max": 1, "points": 6 }, //Grimy tarromin
        { "id": 205, "min": 1, "max": 1, "points": 6 }, //Grimy harralander
        { "id": 207, "min": 1, "max": 1, "points": 6 }, //Grimy ranarr weed
        { "id": 209, "min": 1, "max": 1, "points": 3 }, //Grimy irit leaf
        { "id": 211, "min": 1, "max": 1, "points": 3 }, //Grimy avantoe
        { "id": 213, "min": 1, "max": 1, "points": 3 }, //Grimy kwuarm
        { "id": 215, "min": 1, "max": 1, "points": 1 }, //Grimy cadantine
        { "id": 2485, "min": 1, "max": 1, "points": 1 }, //Grimy lantadyme
        { "id": 217, "min": 1, "max": 1, "points": 1 } //Grimy dwarf weed
      ]
    },
    {
      "name": "Runes",
      "points": 1,
      "items": [
        { "id": 555, "min": 1, "max": 12, "points": 6 }, //Water rune
        { "id": 557, "min": 1, "max": 20, "points": 6 }, //Earth rune
        { "id": 561, "min": 1, "max": 5, "points": 3 }, //Nature rune
        { "id": 564, "min": 1, "max": 7, "points": 3 }, //Cosmic rune
        { "id": 4698, "min": 1, "max": 15, "points": 1 } //Mud rune
      ]
    },
    {
      "name": "Other",
      "points": 1,
      "items": [
        { "id": 13307, "min": 10, "max": 20, "points": 12 }, //Blood money
        { "id": 10978, "min": 1, "max": 8, "points": 6 }, //Swamp weed
        { "id": 1623, "min": 1, "max": 1, "points": 6 }, //Uncut sapphire
        { "id": 1619, "min": 1, "max": 1, "points": 3 }, //Uncut ruby
        { "id": 7416, "min": 1, "max": 1, "points": 1 } //Mole claw
      ]
    }
  ]
}
