{
  "points": 0,
  "items": [],
  "npcs": [
	2,
	3,
	4,
	5,
	6,
	7,
	7402
  ],
  "items": [],
  "tables": [
	{
	  "name": "Seeds",
	  "points": 3,
	  "items": [
		{
		  "id": 5281,
		  "amount": 1,
		  "points": 1
		},
		{
		  "id": 5280,
		  "amount": 1,
		  "points": 1
		},
		{
		  "id": 5297,
		  "amount": 1,
		  "points": 1
		},
		{
		  "id": 5296,
		  "amount": 1,
		  "points": 1
		},
		{
		  "id": 5298,
		  "amount": 1,
		  "points": 6
		},
		{
		  "id": 5301,
		  "amount": 1,
		  "points": 1
		},
		{
		  "id": 5299,
		  "amount": 1,
		  "points": 1
		},
		{
		  "id": 5106,
		  "amount": 1,
		  "points": 1
		},
		{
		  "id": 5302,
		  "amount": 1,
		  "points": 1
		},
		{
		  "id": 5303,
		  "amount": 1,
		  "points": 1
		},
		{
		  "id": 5300,
		  "amount": 1,
		  "points": 1
		},
		{
		  "id": 5304,
		  "amount": 1,
		  "points": 1
		}
	  ],
	  "tables": []
	},
	{
	  "name": "Herbs",
	  "points": 1,
	  "items": [
		{
		  "id": 199,
		  "min": 1,
		  "max": 3,
		  "points": 1
		},
		{
		  "id": 201,
		  "min": 1,
		  "max": 3,
		  "points": 1
		},
		{
		  "id": 203,
		  "min": 1,
		  "max": 3,
		  "points": 3
		},
		{
		  "id": 205,
		  "min": 1,
		  "max": 3,
		  "points": 3
		},
		{
		  "id": 207,
		  "min": 1,
		  "max": 3,
		  "points": 1
		},
		{
		  "id": 209,
		  "min": 1,
		  "max": 3,
		  "points": 1
		},
		{
		  "id": 211,
		  "min": 1,
		  "max": 3,
		  "points": 1
		},
		{
		  "id": 213,
		  "min": 1,
		  "max": 3,
		  "points": 2
		},
		{
		  "id": 215,
		  "min": 1,
		  "max": 3,
		  "points": 1
		},
		{
		  "id": 2485,
		  "min": 1,
		  "max": 3,
		  "points": 1
		},
		{
		  "id": 217,
		  "min": 1,
		  "max": 3,
		  "points": 1
		}
	  ],
	  "tables": []
	},
	{
	  "name": "Weapons",
	  "points": 1,
	  "items": [
		{
		  "id": 1353,
		  "amount": 1,
		  "points": 1
		},
		{
		  "id": 1197,
		  "amount": 1,
		  "points": 1
		},
		{
		  "id": 3053,
		  "amount": 1,
		  "points": 1
		},
		{
		  "id": 1073,
		  "amount": 1,
		  "points": 1
		},
		{
		  "id": 1163,
		  "amount": 1,
		  "points": 1
		},
		{
		  "id": 4103,
		  "amount": 1,
		  "points": 1
		}
	  ],
	  "tables": []
	},
	{
	  "name": "Other",
	  "points": 1,
	  "items": [
		{
		  "id": 995,
		  "min": 1,
		  "max": 460,
		  "points": 1
		}
	  ],
	  "tables": []
	}
  ]
}