{
  "npcs": [ 3612, 6469, 7268 ],
  "PVPWorld": true,
  "tables": [
    {
      "name": "Haunted Mine",
      "points": 1,
      "items": [
        { "id": 1267, "min": 1, "max": 1, "points": 1 } //Iron pickaxe
      ]
    },
    {
      "name": "Catacombs of Kourend",
      "points": 1,
      "items": [
        { "id": 1267, "min": 1, "max": 1, "points": 12 }, //Iron pickaxe
        { "id": 1269, "min": 1, "max": 1, "points": 9 }, //Steel pickaxe
        { "id": 1273, "min": 1, "max": 1, "points": 6 }, //Mithril pickaxe
        { "id": 1271, "min": 1, "max": 1, "points": 3 }, //Adamant pickaxe
        { "id": 1275, "min": 1, "max": 1, "points": 1 } //Rune pickaxe
      ]
    }
  ]
}
