{
  "npcs": [ 1277 ],
  "guaranteed": [
    { "id": 3396, "min": 1, "max": 1 } //Loar remains
  ],
  "PVPWorld": true,
  "tables": [
    {
      "name": "Runes/Ammunition",
      "points": 1,
      "items": [
        { "id": 877, "min": 7, "max": 10, "points": 1 } //Bronze bolts
      ]
    }
  ]
}
