{
  "points": 0,
  "items": [],
  "npcs": [
	421,
	7392
  ],
  "guaranteed": [
	{
	  "id": 526
	}
	// Bones = 526, amount is by default 1 unless specified
  ],
  "tables": [
	{
	  "name": "Weapons",
	  "points": 1,
	  "items": [
		{
		  "id": 4115,
		  "amount": 1,
		  "points": 6
		}
	  ],
	  "tables": []
	},
	{
	  "name": "Ores",
	  "points": 45,
	  "items": [
		{
		  "id": 453,
		  "amount": 1,
		  "points": 6
		},
		{
		  "id": 440,
		  "amount": 1,
		  "points": 6
		},
		{
		  "id": 2349,
		  "amount": 1,
		  "points": 3
		},
		{
		  "id": 2351,
		  "amount": 1,
		  "points": 3
		},
		{
		  "id": 436,
		  "amount": 1,
		  "points": 3
		},
		{
		  "id": 438,
		  "amount": 1,
		  "points": 3
		},
		{
		  "id": 447,
		  "amount": 1,
		  "points": 1
		}
	  ],
	  "tables": []
	},
	{
	  "name": "Other",
	  "points": 45,
	  "items": [
		{
		  "id": 1913,
		  "amount": 1,
		  "points": 6
		},
		{
		  "id": 557,
		  "min": 5,
		  "max": 42,
		  "points": 6
		},
		{
		  "id": 2347,
		  "amount": 1,
		  "points": 6
		},
		{
		  "id": 562,
		  "amount": 2,
		  "points": 3
		},
		{
		  "id": 5319,
		  "amount": 4,
		  "points": 3
		},
		{
		  "id": 5318,
		  "amount": 4,
		  "points": 3
		},
		{
		  "id": 5324,
		  "amount": 4,
		  "points": 3
		},
		{
		  "id": 5322,
		  "amount": 3,
		  "points": 3
		},
		{
		  "id": 5323,
		  "amount": 2,
		  "points": 3
		},
		{
		  "id": 5320,
		  "amount": 3,
		  "points": 3
		},
		{
		  "id": 5321,
		  "amount": 2,
		  "points": 1
		},
		{
		  "id": 1452,
		  "amount": 1,
		  "points": 1
		}
	  ],
	  "tables": []
	}
  ]
}