{
  "npcs": [ 499 ],
  "guaranteed": [
    { "id": 592, "min": 1, "max": 1 }, //Ashes
    { "id": 13307, "min": 100, "max": 250 } //Blood money
  ],
  "PVPWorld": true,
  "petItem": 12648,
  "petRarity": 500,
  "tables": [
    {
      "name": "Armour",
      "points": 1,
      "items": [
        { "id": 13307, "min": 20, "max": 50, "points": 3 }, //Blood money
        { "id": 11937, "min": 5, "max": 10, "points": 3 }, //Dark crab
        { "id": 10926, "min": 2, "max": 10, "points": 3 }, //Sanfew serum(4)
        { "id": 5953, "min": 2, "max": 10, "points": 3 }, //Antidote++(4) (noted)
        { "id": 12696, "min": 2, "max": 10, "points": 3 }, //Super combat potion(4) (noted)
        { "id": 11998, "min": 1, "max": 1, "points": 1 }, //Smoke battlestaff
        { "id": 12002, "min": 1, "max": 1, "points": 1 }, //Occult necklace
        { "id": 3140, "min": 1, "max": 1, "points": 1 } //Dragon chainbody
      ]
    },
    {
      "name": "Other",
      "points": 3,
      "items": []}
  ]
}
