{
  "npcs": [ 2266, 6497 ],
  "guaranteed": [
    { "id": 6729, "min": 1, "max": 1 }, //Dagannoth bones
    { "id": 6155, "min": 1, "max": 1 }, //Dagannoth hide
    { "id": 13307, "min": 25, "max": 75 } //Blood money
  ],
  "PVPWorld": true,
  "petItem": 12644,
  "petRarity": 500,
  "tables": [
    {
      "name": "Armour",
      "points": 1,
      "items": [
        { "id": 13307, "min": 20, "max": 50, "points": 4 }, //Blood money
        { "id": 11937, "min": 5, "max": 10, "points": 4 }, //Dark crab
        { "id": 10925, "min": 2, "max": 10, "points": 4 }, //Sanfew serum(4)
        { "id": 5953, "min": 2, "max": 10, "points": 4 }, //Antidote++(4) (noted)
        { "id": 12696, "min": 2, "max": 10, "points": 4 }, //Super combat potion(4) (noted)
        { "id": 6731, "min": 1, "max": 1, "points": 1 } //Seers ring
      ]
    },
    {
      "name": "Empty",
      "points": 8,
      "items": []
    }
  ]
}
