{
  "npcs": [ 7410 ],
  "guaranteed": [
    { "id": 592, "min": 1, "max": 1 }, //Ashes
    { "id": 13508, "min": 1, "max": 1 } //Ensouled abyssal head
  ],
  "PVPWorld": true,
  "tables": [
    {
      "name": "Weapons",
      "points": 1,
      "items": [
        { "id": 1283, "min": 1, "max": 1, "points": 1 }, //Black sword
        { "id": 1361, "min": 1, "max": 1, "points": 1 }, //Black axe
        { "id": 1365, "min": 1, "max": 1, "points": 1 }, //Steel battleaxe
        { "id": 4151, "min": 1, "max": 1, "points": 1 }, //Abyssal whip
        { "id": 13265, "min": 1, "max": 1, "points": 1 } //Abyssal dagger
      ]
    },
    {
      "name": "Armour",
      "points": 1,
      "items": [
        { "id": 1197, "min": 1, "max": 1, "points": 10 }, //Mithril kiteshield
        { "id": 1113, "min": 1, "max": 1, "points": 3 }, //Rune chainbody
        { "id": 1147, "min": 1, "max": 1, "points": 1 } //Rune med helm
      ]
    },
    {
      "name": "Herbs",
      "points": 1,
      "items": [
        { "id": 199, "min": 1, "max": 1, "points": 3 }, //Grimy guam leaf
        { "id": 201, "min": 1, "max": 1, "points": 3 }, //Grimy marrentill
        { "id": 203, "min": 1, "max": 1, "points": 3 }, //Grimy tarromin
        { "id": 205, "min": 1, "max": 1, "points": 3 }, //Grimy harralander
        { "id": 207, "min": 1, "max": 1, "points": 3 }, //Grimy ranarr weed
        { "id": 209, "min": 1, "max": 1, "points": 3 }, //Grimy irit leaf
        { "id": 211, "min": 1, "max": 1, "points": 1 }, //Grimy avantoe
        { "id": 213, "min": 1, "max": 1, "points": 1 }, //Grimy kwuarm
        { "id": 215, "min": 1, "max": 1, "points": 1 }, //Grimy cadantine
        { "id": 2485, "min": 1, "max": 1, "points": 1 }, //Grimy lantadyme
        { "id": 217, "min": 1, "max": 1, "points": 1 } //Grimy dwarf weed
      ]
    },
    {
      "name": "Runes",
      "points": 1,
      "items": [
        { "id": 556, "min": 50, "max": 50, "points": 3 }, //Air rune
        { "id": 565, "min": 7, "max": 7, "points": 3 }, //Blood rune
        { "id": 562, "min": 10, "max": 10, "points": 3 }, //Chaos rune
        { "id": 563, "min": 3, "max": 3, "points": 1 } //Law rune
      ]
    },
    {
      "name": "Other",
      "points": 1,
      "items": [
        { "id": 13307, "min": 20, "max": 30, "points": 15 }, //Blood money
        { "id": 379, "min": 1, "max": 1, "points": 12 }, //Lobster
        { "id": 7937, "min": 60, "max": 60, "points": 12 }, //Pure essence (noted)
        { "id": 1454, "min": 1, "max": 1, "points": 12 }, //Cosmic talisman
        { "id": 1452, "min": 1, "max": 1, "points": 12 }, //Chaos talisman
        { "id": 2361, "min": 1, "max": 1, "points": 12 }, //Adamantite bar
        { "id": 133, "min": 1, "max": 1, "points": 6 }, //Defence potion(3)
        { "id": 7979, "min": 1, "max": 1, "points": 1 } //Abyssal head
      ]
    }
  ]
}
