{
  "npcs": [ 265, 266, 267, 268, 269, 5878, 5879, 5880, 5881, 5882 ],
  "guaranteed": [
    { "id": 1751, "min": 1, "max": 1 }, //Blue dragonhide
    { "id": 536, "min": 1, "max": 1 } //Dragon bones
  ],
  "PVPWorld": true,
  "tables": [
    {
      "name": "Weapons/Armour",
      "points": 1,
      "items": [
        { "id": 1365, "min": 1, "max": 1, "points": 6 }, //Steel battleaxe
        { "id": 1355, "min": 1, "max": 1, "points": 6 }, //Mithril axe
        { "id": 1243, "min": 1, "max": 1, "points": 6 }, //Mithril spear
        { "id": 1069, "min": 1, "max": 1, "points": 6 }, //Steel platelegs
        { "id": 1197, "min": 1, "max": 1, "points": 3 }, //Mithril kiteshield
        { "id": 1161, "min": 1, "max": 1, "points": 1 }, //Adamant full helm
        { "id": 1213, "min": 1, "max": 1, "points": 1 } //Rune dagger
      ]
    },
    {
      "name": "Runes",
      "points": 1,
      "items": [
        { "id": 555, "min": 75, "max": 75, "points": 6 }, //Water rune
        { "id": 561, "min": 15, "max": 15, "points": 6 }, //Nature rune
        { "id": 554, "min": 37, "max": 37, "points": 3 }, //Fire rune
        { "id": 563, "min": 3, "max": 3, "points": 1 } //Law rune
      ]
    },
    {
      "name": "Herbs",
      "points": 1,
      "items": [
        { "id": 199, "min": 1, "max": 1, "points": 6 }, //Grimy guam leaf
        { "id": 205, "min": 1, "max": 1, "points": 6 }, //Grimy harralander
        { "id": 201, "min": 1, "max": 1, "points": 6 }, //Grimy marrentill
        { "id": 203, "min": 1, "max": 1, "points": 3 }, //Grimy tarromin
        { "id": 211, "min": 1, "max": 1, "points": 3 }, //Grimy avantoe
        { "id": 209, "min": 1, "max": 1, "points": 3 }, //Grimy irit leaf
        { "id": 213, "min": 1, "max": 1, "points": 1 }, //Grimy kwuarm
        { "id": 2485, "min": 1, "max": 1, "points": 1 }, //Grimy lantadyme
        { "id": 207, "min": 1, "max": 1, "points": 1 }, //Grimy ranarr weed
        { "id": 215, "min": 1, "max": 1, "points": 1 }, //Grimy cadantine
        { "id": 217, "min": 1, "max": 1, "points": 1 } //Grimy dwarf weed
      ]
    },
    {
      "name": "Other",
      "points": 1,
      "items": [
        { "id": 13307, "min": 10, "max": 30, "points": 12 }, //Blood money
        { "id": 449, "min": 1, "max": 1, "points": 6 }, //Adamantite ore
        { "id": 365, "min": 1, "max": 1, "points": 6 }, //Bass
        { "id": 13511, "min": 1, "max": 1, "points": 3 } //Ensouled dragon head
      ]
    }
  ]
}
