{
  "npcs": [ 626 ],
  "PVPWorld": true,
  "tables": [
    {
      "name": "Other",
      "points": 1,
      "items": [
        { "id": 213, "min": 1, "max": 1, "points": 1 } //Grimy kwuarm
      ]
    }
  ]
}
