{
	"default": {
		"sapBrandColor": "#f93939",
		"sapHighlightColor": "#f93939",
		"sapBaseColor": "#ffffff",
		"sapShellColor": "transparent",
		"sapBackgroundColor": "rgba(255,255,255, 0.56)",
		"sapFontFamily": "\"72\", Arial, Helvetica, sans-serif",
		"sapFontSize": "0.75em",
		"sapTextColor": "#333333",
		"sapLinkColor": "#0070b1",
		"sapCompanyLogo": "url('../../../../../../Base/baseLib/decortheme/img/misc/sapCompanyLogo.png')",
		"sapBackgroundImage": "url('../../../../../../Base/baseLib/decortheme/img/misc/sapBackgroundImage.jpeg')",
		"sapBackgroundImageOpacity": "0.06",
		"sapBackgroundImageRepeat": "false",
		"sapSelectedColor": "#f93939",
		"sapActiveColor": "#f93939",
		"sapHighlightTextColor": "#fff",
		"sapTitleColor": "#333333",
		"sapNegativeColor": "#bb0000",
		"sapCriticalColor": "#e78c07",
		"sapPositiveColor": "#2b7d2b",
		"sapNeutralColor": "#5e696e",
		"sapNegativeElementColor": "#bb0000",
		"sapCriticalElementColor": "#e78c07",
		"sapPositiveElementColor": "#2b7d2b",
		"sapNeutralElementColor": "#5e696e",
		"sapContent_LineHeight": "1.3",
		"sapContent_ElementHeight": "1.37em",
		"sapContent_ElementHeight_PX": "22px",
		"sapContent_IconHeight": "16px",
		"sapContent_IconColor": "#f80707",
		"sapContent_ContrastIconColor": "#fff",
		"sapContent_NonInteractiveIconColor": "#878787",
		"sapContent_MarkerIconColor": "#678bc7",
		"sapContent_MarkerTextColor": "#147575",
		"sapContent_ImagePlaceholderBackground": "#e8e8e8",
		"sapContent_ImagePlaceholderForegroundColor": "#fff",
		"sapContent_FocusColor": "#000",
		"sapContent_ContrastFocusColor": "#fff",
		"sapContent_ShadowColor": "#000",
		"sapContent_ContrastShadowColor": "#fff",
		"sapContent_SearchHighlightColor": "#d4f7db",
		"sapContent_HelpColor": "#3f8600",
		"sapContent_LabelColor": "#666",
		"sapContent_MonospaceFontFamily": "lucida console, monospace",
		"sapContent_DisabledTextColor": "rgba(51,51,51,0.5)",
		"sapContent_DisabledOpacity": "0.5",
		"sapContent_ContrastTextThreshold": "0.65",
		"sapContent_ContrastTextColor": "#fff",
		"sapContent_ForegroundColor": "#e5e5e5",
		"sapContent_ForegroundBorderColor": "#bfbfbf",
		"sapContent_ForegroundTextColor": "#333",
		"sapShell_Background": "#f6cbcb",
		"sapShell_BackgroundImage": "linear-gradient(to bottom, #f3a6a6, #faefef)",
		"sapShell_BackgroundGradient": "linear-gradient(to bottom, #f3a6a6, #faefef)",
		"sapShell_BackgroundImageOpacity": "0.46",
		"sapShell_BackgroundImageRepeat": "false",
		"sapShell_BorderColor": "transparent",
		"sapShell_TextColor": "#f80707",
		"sapShell_Favicon": "url('../../../../../../Base/baseLib/decortheme/img/misc/sapShell_Favicon.png')",
		"sapButton_BorderWidth": "1px",
		"sapButton_BorderCornerRadius": "3px",
		"sapButton_Background": "#ffffff",
		"sapButton_BorderColor": "#b3b3b3",
		"sapButton_TextColor": "#f80707",
		"sapButton_Disabled_Background": "lime",
		"sapButton_Disabled_BorderColor": "lime",
		"sapButton_Disabled_TextColor": "lime",
		"sapButton_Hover_Background": "#f2f2f2",
		"sapButton_Hover_BorderColor": "#b3b3b3",
		"sapButton_Hover_TextColor": "#f80707",
		"sapButton_Emphasized_Background": "#f66",
		"sapButton_Emphasized_BorderColor": "#ff4c4c",
		"sapButton_Emphasized_TextColor": "#fff",
		"sapButton_Reject_Background": "#ffffff",
		"sapButton_Accept_Background": "#ffffff",
		"sapField_Background": "#ffffff",
		"sapField_BorderColor": "#bfbfbf",
		"sapField_TextColor": "#000",
		"sapField_HelpBackground": "#ffffff",
		"sapField_BorderWidth": "1px",
		"sapField_BorderCornerRadius": "0",
		"sapField_Hover_Background": "#ffffff",
		"sapField_Hover_BorderColor": "#f93939",
		"sapField_Hover_HelpBackground": "#f93939",
		"sapField_Focus_Background": "#ffffff",
		"sapField_Focus_BorderColor": "#bfbfbf",
		"sapField_Focus_HelpBackground": "#ffffff",
		"sapField_Disabled_Background": "lime",
		"sapField_Disabled_BorderColor": "lime",
		"sapField_Disabled_TextColor": "rgba(0,0,0,0.5)",
		"sapField_Disabled_HelpBackground": "lime",
		"sapField_ReadOnly_Background": "rgba(242,242,242,0.5)",
		"sapField_ReadOnly_BorderColor": "#ccc",
		"sapField_ReadOnly_HelpBackground": "rgba(242,242,242,0.5)",
		"sapField_RequiredColor": "#c14646",
		"sapField_InvalidColor": "#e00",
		"sapField_InvalidBackground": "#ffffff",
		"sapField_WarningColor": "#f9a429",
		"sapField_WarningBackground": "#ffffff",
		"sapField_SuccessColor": "#38a338",
		"sapField_SuccessBackground": "#ffffff",
		"sapGroup_TitleBackground": "transparent",
		"sapGroup_TitleBorderColor": "#ccc",
		"sapGroup_TitleTextColor": "#333",
		"sapGroup_Title_FontSize": "1.0em",
		"sapGroup_ContentBackground": "rgba(255,255,255,0.56)",
		"sapGroup_ContentBorderColor": "rgba(235,235,235,0.56)",
		"sapGroup_BorderWidth": "1px",
		"sapGroup_BorderCornerRadius": "0",
		"sapGroup_FooterBackground": "transparent",
		"sapToolbar_Background": "transparent",
		"sapToolbar_SeparatorColor": "rgba(63,81,97,0.2)",
		"sapList_HeaderBackground": "#fafafa",
		"sapList_HeaderBorderColor": "rgba(229,229,229, 0.01)",
		"sapList_HeaderTextColor": "#333",
		"sapList_BorderColor": "rgba(229,229,229, 0.01)",
		"sapList_BorderWidth": "1px",
		"sapList_HighlightColor": "#f93939",
		"sapList_SelectionBackgroundColor": "#fff",
		"sapList_Background": "#ffffff",
		"sapList_Hover_Background": "#f0f0f0",
		"sapScrollBar_FaceColor": "#fc8383",
		"sapScrollBar_TrackColor": "#fff",
		"sapScrollBar_BorderColor": "#fc8383",
		"sapScrollBar_SymbolColor": "#f80707",
		"sapScrollBar_Dimension": "16px",
		"sapScrollBar_Hover_FaceColor": "#fc7474",
		"sapPageHeader_Background": "#ffffff",
		"sapPageHeader_BorderColor": "#ebebeb",
		"sapPageHeader_TextColor": "#666",
		"sapPageFooter_Background": "#ffffff",
		"sapPageFooter_TextColor": "#333",
		"sapInfobar_Background": "#168282",
		"sapObjectHeader_Background": "#ffffff",
		"sapBlockLayer_Background": "#000",
		"sapTile_Background": "#ffffff",
		"sapTile_BorderColor": "transparent",
		"sapTile_TitleTextColor": "#333",
		"sapTile_TextColor": "#666",
		"sapTile_IconColor": "#fdb0b0",
		"sapChart_OrderedColor_1": "#5899da",
		"sapChart_OrderedColor_2": "#e8743b",
		"sapChart_OrderedColor_3": "#19a979",
		"sapChart_OrderedColor_4": "#ed4a7b",
		"sapChart_OrderedColor_5": "#945ecf",
		"sapChart_OrderedColor_6": "#13a4b4",
		"sapChart_OrderedColor_7": "#525df4",
		"sapChart_OrderedColor_8": "#bf399e",
		"sapChart_OrderedColor_9": "#6c8893",
		"sapChart_OrderedColor_10": "#ee6868",
		"sapChart_OrderedColor_11": "#2f6497",
		"sapChart_Bad": "#dc0d0e",
		"sapChart_Critical": "#de890d",
		"sapChart_Good": "#3fa45b",
		"sapChart_Neutral": "#848f94",
		"sapChart_Sequence_1": "#5899da",
		"sapChart_Sequence_2": "#e8743b",
		"sapChart_Sequence_3": "#19a979",
		"sapChart_Sequence_4": "#ed4a7b",
		"sapChart_Sequence_5": "#945ecf",
		"sapChart_Sequence_6": "#13a4b4",
		"sapChart_Sequence_7": "#525df4",
		"sapChart_Sequence_8": "#bf399e",
		"sapChart_Sequence_9": "#6c8893",
		"sapChart_Sequence_10": "#ee6868",
		"sapChart_Sequence_11": "#2f6497",
		"sapChart_Sequence_Neutral": "#848f94",
		"sapUiBrand": "#f93939",
		"sapUiHighlight": "#f93939",
		"sapUiBaseColor": "#ffffff",
		"sapUiShellColor": "transparent",
		"sapUiBaseBG": "rgba(255,255,255, 0.56)",
		"sapUiGlobalBackgroundColor": "rgba(255,255,255, 0.56)",
		"sapUiBaseText": "#333333",
		"sapUiLink": "#0070b1",
		"sapUiGlobalLogo": "url('../../../../../../Base/baseLib/decortheme/img/misc/sapCompanyLogo.png')",
		"sapUiGlobalBackgroundImage": "url('../../../../../../Base/baseLib/decortheme/img/misc/sapBackgroundImage.jpeg')",
		"sapUiBackgroundImage": "url('../../../../../../Base/baseLib/decortheme/img/misc/sapBackgroundImage.jpeg')",
		"sapUiUx3ShellBackgroundImageURL": "url('../../../../../../Base/baseLib/decortheme/img/misc/sapBackgroundImage.jpeg')",
		"sapUiGlobalBackgroundImageOpacity": "0.06",
		"sapUiGlobalBackgroundRepeat": "false",
		"sapUiSelected": "#f93939",
		"sapUiActive": "#f93939",
		"sapUiHighlightTextColor": "#fff",
		"sapUiTextTitle": "#333333",
		"sapUiContentIconColor": "#f80707",
		"sapUiContentContrastIconColor": "#fff",
		"sapUiContentNonInteractiveIconColor": "#878787",
		"sapUiContentMarkerIconColor": "#678bc7",
		"sapUiContentMarkerTextColor": "#147575",
		"sapUiContentImagePlaceholderBackground": "#e8e8e8",
		"sapUiContentImagePlaceholderForegroundColor": "#fff",
		"sapUiContentFocusColor": "#000",
		"sapUiContentContrastFocusColor": "#fff",
		"sapUiContentShadowColor": "#000",
		"sapUiContentContrastShadowColor": "#fff",
		"sapUiContentSearchHighlightColor": "#d4f7db",
		"sapUiContentHelpColor": "#3f8600",
		"sapUiContentLabelColor": "#666",
		"sapUiContentDisabledTextColor": "rgba(51,51,51,0.5)",
		"sapUiContentDisabledOpacity": "0.5",
		"sapUiContentContrastTextThreshold": "0.65",
		"sapUiContentContrastTextColor": "#fff",
		"sapUiContentForegroundColor": "#e5e5e5",
		"sapUiContentForegroundBorderColor": "#bfbfbf",
		"sapUiContentForegroundTextColor": "#333",
		"sapUiShellBackground": "#f6cbcb",
		"sapUiShellBackgroundImage": "linear-gradient(to bottom, #f3a6a6, #faefef)",
		"sapUiShellBackgroundImageOpacity": "0.46",
		"sapUiShellBackgroundImageRepeat": "false",
		"sapUiShellBackgroundGradient": "linear-gradient(to bottom, #f3a6a6, #faefef)",
		"sapUiShellBorderColor": "transparent",
		"sapUiShellTextColor": "#f80707",
		"sapUiShellFavicon": "url('../../../../../../Base/baseLib/decortheme/img/misc/sapShell_Favicon.png')",
		"sapUiButtonBackground": "#ffffff",
		"sapUiButtonBorderColor": "#b3b3b3",
		"sapUiButtonTextColor": "#f80707",
		"sapUiButtonDisabledBackground": "lime",
		"sapUiButtonDisabledBorderColor": "lime",
		"sapUiButtonDisabledTextColor": "lime",
		"sapUiButtonHoverBackground": "#f2f2f2",
		"sapUiButtonHoverBorderColor": "#b3b3b3",
		"sapUiButtonHoverTextColor": "#f80707",
		"sapUiButtonEmphasizedBackground": "#f66",
		"sapUiButtonEmphasizedBorderColor": "#ff4c4c",
		"sapUiButtonEmphasizedTextColor": "#fff",
		"sapUiButtonRejectBackground": "#ffffff",
		"sapUiButtonAcceptBackground": "#ffffff",
		"sapUiFieldBackground": "#ffffff",
		"sapUiFieldBorderColor": "#bfbfbf",
		"sapUiFieldTextColor": "#000",
		"sapUiFieldHelpBackground": "#ffffff",
		"sapUiFieldHoverBackground": "#ffffff",
		"sapUiFieldHoverBorderColor": "#f93939",
		"sapUiFieldHoverHelpBackground": "#f93939",
		"sapUiFieldFocusBackground": "#ffffff",
		"sapUiFieldFocusBorderColor": "#bfbfbf",
		"sapUiFieldFocusHelpBackground": "#ffffff",
		"sapUiFieldReadOnlyBackground": "rgba(242,242,242,0.5)",
		"sapUiFieldReadOnlyBorderColor": "#ccc",
		"sapUiFieldReadOnlyHelpBackground": "rgba(242,242,242,0.5)",
		"sapUiFieldDisabledBackground": "lime",
		"sapUiFieldDisabledBorderColor": "lime",
		"sapUiFieldDisabledTextColor": "rgba(0,0,0,0.5)",
		"sapUiFieldDisabledHelpBackground": "lime",
		"sapUiFieldRequiredColor": "#c14646",
		"sapUiFieldInvalidColor": "#e00",
		"sapUiFieldInvalidBackground": "#ffffff",
		"sapUiFieldWarningColor": "#f9a429",
		"sapUiFieldWarningBackground": "#ffffff",
		"sapUiFieldSuccessColor": "#38a338",
		"sapUiFieldSuccessBackground": "#ffffff",
		"sapUiGroupTitleBackground": "transparent",
		"sapUiGroupTitleBorderColor": "#ccc",
		"sapUiGroupTitleTextColor": "#333",
		"sapUiGroupContentBackground": "rgba(255,255,255,0.56)",
		"sapUiGroupContentBorderColor": "rgba(235,235,235,0.56)",
		"sapUiGroupFooterBackground": "transparent",
		"sapUiToolbarBackground": "transparent",
		"sapUiToolbarSeparatorColor": "rgba(63,81,97,0.2)",
		"sapUiListHeaderBackground": "#fafafa",
		"sapUiListHeaderBorderColor": "rgba(229,229,229, 0.01)",
		"sapUiListHeaderTextColor": "#333",
		"sapUiListBorderColor": "rgba(229,229,229, 0.01)",
		"sapUiListHighlightColor": "#f93939",
		"sapUiListSelectionBackgroundColor": "#fff",
		"sapUiListBackground": "#ffffff",
		"sapUiListHoverBackground": "#f0f0f0",
		"sapUiScrollBarFaceColor": "#fc8383",
		"sapUiScrollBarTrackColor": "#fff",
		"sapUiScrollBarBorderColor": "#fc8383",
		"sapUiScrollBarSymbolColor": "#f80707",
		"sapUiScrollBarHoverFaceColor": "#fc7474",
		"sapUiPageHeaderBackground": "#ffffff",
		"sapUiPageHeaderBorderColor": "#ebebeb",
		"sapUiPageHeaderTextColor": "#666",
		"sapUiPageFooterBackground": "#ffffff",
		"sapUiPageFooterTextColor": "#333",
		"sapUiInfobarBackground": "#168282",
		"sapUiObjectHeaderBackground": "#ffffff",
		"sapUiBlockLayerBackground": "#000",
		"sapUiTileBackground": "#ffffff",
		"sapUiTileBorderColor": "transparent",
		"sapUiTileTitleTextColor": "#333",
		"sapUiTileTextColor": "#666",
		"sapUiTileIconColor": "#fdb0b0",
		"sapUiChart1": "#5899da",
		"sapUiChart2": "#e8743b",
		"sapUiChart3": "#19a979",
		"sapUiChart4": "#ed4a7b",
		"sapUiChart5": "#945ecf",
		"sapUiChart6": "#13a4b4",
		"sapUiChart7": "#525df4",
		"sapUiChart8": "#bf399e",
		"sapUiChart9": "#6c8893",
		"sapUiChart10": "#ee6868",
		"sapUiChart11": "#2f6497",
		"sapUiChartBad": "#dc0d0e",
		"sapUiChartCritical": "#de890d",
		"sapUiChartGood": "#3fa45b",
		"sapUiChartNeutral": "#848f94",
		"sapUiChartSequence1": "#5899da",
		"sapUiChartSequence2": "#e8743b",
		"sapUiChartSequence3": "#19a979",
		"sapUiChartSequence4": "#ed4a7b",
		"sapUiChartSequence5": "#945ecf",
		"sapUiChartSequence6": "#13a4b4",
		"sapUiChartSequence7": "#525df4",
		"sapUiChartSequence8": "#bf399e",
		"sapUiChartSequence9": "#6c8893",
		"sapUiChartSequence10": "#ee6868",
		"sapUiChartSequence11": "#2f6497",
		"sapUiChartSequenceNeutral": "#848f94",
		"sapUiAccent1": "#e09d00",
		"sapUiAccent2": "#e6600d",
		"sapUiAccent3": "#c14646",
		"sapUiAccent4": "#ab218e",
		"sapUiAccent5": "#678bc7",
		"sapUiAccent6": "#0092d1",
		"sapUiAccent7": "#1a9898",
		"sapUiAccent8": "#759421",
		"sapUiErrorBG": "#ffe4e4",
		"sapUiWarningBG": "#fef0db",
		"sapUiSuccessBG": "#e4f6e4",
		"sapUiNeutralBG": "#f4f5f6",
		"sapUiErrorBorder": "#e00",
		"sapUiWarningBorder": "#f9a429",
		"sapUiSuccessBorder": "#38a338",
		"sapUiNeutralBorder": "#5e696e",
		"sapUiNegativeElement": "#bb0000",
		"sapUiCriticalElement": "#e78c07",
		"sapUiPositiveElement": "#2b7d2b",
		"sapUiNeutralElement": "#5e696e",
		"sapUiNegativeText": "#bb0000",
		"sapUiCriticalText": "#e78c07",
		"sapUiPositiveText": "#2b7d2b",
		"sapUiNeutralText": "#5e696e",
		"sapUiNegative": "#bb0000",
		"sapUiCritical": "#e78c07",
		"sapUiPositive": "#2b7d2b",
		"sapUiNeutral": "#5e696e",
		"sapUiErrorColor": "#e00",
		"sapUiWarningColor": "#f9a429",
		"sapUiSuccessColor": "#38a338",
		"sapUiFontFamily": "\"72\", Arial, Helvetica, sans-serif",
		"sapUiFontSize": "16px",
		"sapUiFontCondensedFamily": "'Arial Narrow', HelveticaNeue-CondensedBold, Arial, sans-serif",
		"sapUiFontHeaderFamily": "\"72\", Arial, Helvetica, sans-serif",
		"sapUiFontHeaderWeight": "normal",
		"sapMFontHeader1Size": "1.625rem",
		"sapMFontHeader2Size": "1.375rem",
		"sapMFontHeader3Size": "1.250rem",
		"sapMFontHeader4Size": "1.125rem",
		"sapMFontHeader5Size": "1rem",
		"sapMFontHeader6Size": "0.875rem",
		"sapMFontSmallSize": "0.75rem",
		"sapMFontMediumSize": "0.875rem",
		"sapMFontLargeSize": "1rem",
		"sapUiTranslucentBGOpacity": "0",
		"sapMPlatformDependent": "false",
		"sapUiDesktopFontFamily": "\"72\", Arial, Helvetica, sans-serif",
		"sapUiDesktopFontSize": "12px",
		"sapUiFontLargeSize": "13px",
		"sapUiFontSmallSize": "11px",
		"sapUiFontHeader1Size": "26px",
		"sapUiFontHeader2Size": "20px",
		"sapUiFontHeader3Size": "18px",
		"sapUiFontHeader4Size": "16px",
		"sapUiFontHeader5Size": "14px",
		"sapUiFontHeader6Size": "13px",
		"sapUiLineHeight": "18px",
		"sapUiChartLabelHoverColor": "#f2f2f2",
		"sapUiChartLabelPressedColor": "#d4d4d4",
		"sapUiChartCategoryAxisLabelFontColor": "#333",
		"sapUiChartValueAxisLabelFontColor": "#707070",
		"sapUiChartCategoryAxisLabelFontSize": "0.75rem",
		"sapUiChartValueAxisLabelFontSize": "0.75rem",
		"sapUiChartCategoryAxisLineColor": "#ccc",
		"sapUiChartValueAxisLineColor": "#ccc",
		"sapUiChartCategoryAxisTickColor": "#ccc",
		"sapUiChartValueAxisTickColor": "#ccc",
		"sapUiChartBackgroundColor": "transparent",
		"sapUiChartLabelFontWeight": "normal",
		"sapUiChartLegendLabelFontColor": "#333",
		"sapUiChartLegendTitleFontColor": "#333",
		"sapUiChartLegendTitleFontSize": "0.875rem",
		"sapUiChartLegendLabelFontSize": "0.75rem",
		"sapUiChartPaletteUndefinedColor": "#000",
		"sapUiChartGridlineColor": "#e5e5e5",
		"sapUiChartReferenceLineColor": "#333",
		"sapUiChartDataLabelFontColor": "#000",
		"sapUiChartReferenceLineLabelColor": "#fff",
		"sapUiChartDataLabelFontSize": "0.75rem",
		"sapUiChartPopoverDataItemFontColor": "#000",
		"sapUiChartPopoverGroupFontColor": "#333",
		"sapUiChartPopoverDataItemFontSize": "0.875rem",
		"sapUiChartPopoverGroupFontSize": "0.875rem",
		"sapUiChartPopoverGroupFontWeight": "bold",
		"sapUiChartScrollBarThumbColor": "#fc8383",
		"sapUiChartScrollBarTrackColor": "#fff",
		"sapUiChartScrollBarThumbHoverColor": "#fc7474",
		"sapUiChartMainTitleFontColor": "#333",
		"sapUiChartAxisTitleFontColor": "#333",
		"sapUiChartMainTitleFontSize": "1rem",
		"sapUiChartAxisTitleFontSize": "0.875rem",
		"sapUiChartTitleFontWeight": "bold",
		"sapUiChartLightText": "#707070",
		"sapUiChartZeroAxisColor": "#666",
		"sapUiChartDataPointBorderColor": "rgba(255,255,255,0.56)",
		"sapUiChartDataPointBorderHoverSelectedColor": "#666",
		"sapUiChartDataPointNotSelectedBackgroundOpacity": "0.6",
		"sapUiChartValueAxisLineOpacity": "0",
		"sapUiChartCategoryAxisLabelFontHoverColor": "#333",
		"sapUiChartCategoryAxisLabelFontPressedColor": "#333",
		"sapUiChartTargetColor": "#333",
		"sapUiChartTargetShadowColor": "#fff",
		"sapUiChartBubbleBGOpacity": "0.8",
		"sapUiChartScrollbarBorderColor": "#fff",
		"sapUiChartScrollbarBorderSize": "0",
		"sapUiChartScrollbarThumbPadding": "0",
		"sapUiChartNegativeLargeText": "#dc0d0e",
		"sapUiChartCriticalLargeText": "#de890d",
		"sapUiChartPositiveLargeText": "#3fa45b",
		"sapUiChartNeutralLargeText": "#6a757b",
		"sapUiChartDataPointBG": "#d6dadb",
		"sapUiChartDataPointBGBorderColor": "#d6dadb",
		"sapUiChartDataLineColorWithBG": "#333",
		"sapUiChartDataLineColor": "#333",
		"sapUiChartRadialRemainingCircle": "#e3e6e7",
		"sapUiChartRadialRemainingCircleBorderColor": "#e3e6e7",
		"sapUiChartRadialBG": "rgba(255,255,255,0.56)",
		"sapUiChartLegendHoverBackground": "#f0f0f0",
		"sapUiChartLegendSelectionBackground": "#fff",
		"sapUiChartLegendSelectionHoverBackground": "#f7f7f7",
		"sapUiChartPaletteQualitativeHue1": "#5899da",
		"sapUiChartPaletteQualitativeHue2": "#e8743b",
		"sapUiChartPaletteQualitativeHue3": "#19a979",
		"sapUiChartPaletteQualitativeHue4": "#ed4a7b",
		"sapUiChartPaletteQualitativeHue5": "#945ecf",
		"sapUiChartPaletteQualitativeHue6": "#13a4b4",
		"sapUiChartPaletteQualitativeHue7": "#525df4",
		"sapUiChartPaletteQualitativeHue8": "#bf399e",
		"sapUiChartPaletteQualitativeHue9": "#6c8893",
		"sapUiChartPaletteQualitativeHue10": "#ee6868",
		"sapUiChartPaletteQualitativeHue11": "#2f6497",
		"sapUiChartPaletteQualitativeHue12": "#1866b4",
		"sapUiChartPaletteQualitativeHue13": "#cc4300",
		"sapUiChartPaletteQualitativeHue14": "#03724e",
		"sapUiChartPaletteQualitativeHue15": "#d70947",
		"sapUiChartPaletteQualitativeHue16": "#7629cc",
		"sapUiChartPaletteQualitativeHue17": "#087682",
		"sapUiChartPaletteQualitativeHue18": "#2631d4",
		"sapUiChartPaletteQualitativeHue19": "#921473",
		"sapUiChartPaletteQualitativeHue20": "#3c6372",
		"sapUiChartPaletteQualitativeHue21": "#d52f2f",
		"sapUiChartPaletteQualitativeHue22": "#144a7f",
		"sapUiChartPaletteSemanticBadLight3": "#f99494",
		"sapUiChartPaletteSemanticBadLight2": "#f66364",
		"sapUiChartPaletteSemanticBadLight1": "#f33334",
		"sapUiChartPaletteSemanticBad": "#dc0d0e",
		"sapUiChartPaletteSemanticBadDark1": "#b90c0d",
		"sapUiChartPaletteSemanticBadDark2": "#93090a",
		"sapUiChartPaletteSemanticCriticalLight3": "#f8cc8c",
		"sapUiChartPaletteSemanticCriticalLight2": "#f5b04d",
		"sapUiChartPaletteSemanticCriticalLight1": "#f29b1d",
		"sapUiChartPaletteSemanticCritical": "#de890d",
		"sapUiChartPaletteSemanticCriticalDark1": "#c67a0c",
		"sapUiChartPaletteSemanticCriticalDark2": "#a4650a",
		"sapUiChartPaletteSemanticGoodLight3": "#a1dbb1",
		"sapUiChartPaletteSemanticGoodLight2": "#71c989",
		"sapUiChartPaletteSemanticGoodLight1": "#4cba6b",
		"sapUiChartPaletteSemanticGood": "#3fa45b",
		"sapUiChartPaletteSemanticGoodDark1": "#358a4d",
		"sapUiChartPaletteSemanticGoodDark2": "#2a6d3c",
		"sapUiChartPaletteSemanticNeutralLight3": "#d6dadb",
		"sapUiChartPaletteSemanticNeutralLight2": "#bac1c4",
		"sapUiChartPaletteSemanticNeutralLight1": "#9ea8ad",
		"sapUiChartPaletteSemanticNeutral": "#848f94",
		"sapUiChartPaletteSemanticNeutralDark1": "#6a757b",
		"sapUiChartPaletteSemanticNeutralDark2": "#596368",
		"sapUiChartPaletteSequentialHue1Light3": "#b3d4f5",
		"sapUiChartPaletteSequentialHue1Light2": "#93bfeb",
		"sapUiChartPaletteSequentialHue1Light1": "#74abe2",
		"sapUiChartPaletteSequentialHue1": "#5899da",
		"sapUiChartPaletteSequentialHue1Dark1": "#367dc4",
		"sapUiChartPaletteSequentialHue1Dark2": "#1866b4",
		"sapUiChartPaletteSequentialHue2Light3": "#ffb08a",
		"sapUiChartPaletteSequentialHue2Light2": "#f3b89b",
		"sapUiChartPaletteSequentialHue2Light1": "#f08957",
		"sapUiChartPaletteSequentialHue2": "#e8743b",
		"sapUiChartPaletteSequentialHue2Dark1": "#da5a1b",
		"sapUiChartPaletteSequentialHue2Dark2": "#cc4300",
		"sapUiChartPaletteSequentialHue3Light3": "#8fd1bb",
		"sapUiChartPaletteSequentialHue3Light2": "#66c2a3",
		"sapUiChartPaletteSequentialHue3Light1": "#3fb68f",
		"sapUiChartPaletteSequentialHue3": "#19a979",
		"sapUiChartPaletteSequentialHue3Dark1": "#0d8c62",
		"sapUiChartPaletteSequentialHue3Dark2": "#03724e",
		"sapUiChartPaletteSequentialHue4Light3": "#f8b4c9",
		"sapUiChartPaletteSequentialHue4Light2": "#f490ae",
		"sapUiChartPaletteSequentialHue4Light1": "#f06a93",
		"sapUiChartPaletteSequentialHue4": "#ed4a7b",
		"sapUiChartPaletteSequentialHue4Dark1": "#e32b62",
		"sapUiChartPaletteSequentialHue4Dark2": "#d70947",
		"sapUiChartPaletteSequentialHue5Light3": "#d3bdeb",
		"sapUiChartPaletteSequentialHue5Light2": "#be9de2",
		"sapUiChartPaletteSequentialHue5Light1": "#a97dd8",
		"sapUiChartPaletteSequentialHue5": "#945ecf",
		"sapUiChartPaletteSequentialHue5Dark1": "#8746ce",
		"sapUiChartPaletteSequentialHue5Dark2": "#7629cc",
		"sapUiChartPaletteSequentialHue6Light3": "#81d1da",
		"sapUiChartPaletteSequentialHue6Light2": "#5ac2ce",
		"sapUiChartPaletteSequentialHue6Light1": "#39b4c1",
		"sapUiChartPaletteSequentialHue6": "#13a4b4",
		"sapUiChartPaletteSequentialHue6Dark1": "#0d8d9c",
		"sapUiChartPaletteSequentialHue6Dark2": "#087682",
		"sapUiChartPaletteSequentialHue7Light3": "#99a0f9",
		"sapUiChartPaletteSequentialHue7Light2": "#828af7",
		"sapUiChartPaletteSequentialHue7Light1": "#6973f6",
		"sapUiChartPaletteSequentialHue7": "#525df4",
		"sapUiChartPaletteSequentialHue7Dark1": "#3945e4",
		"sapUiChartPaletteSequentialHue7Dark2": "#2631d4",
		"sapUiChartPaletteSequentialHue8Light3": "#e598d2",
		"sapUiChartPaletteSequentialHue8Light2": "#d877c0",
		"sapUiChartPaletteSequentialHue8Light1": "#cd59b1",
		"sapUiChartPaletteSequentialHue8": "#bf399e",
		"sapUiChartPaletteSequentialHue8Dark1": "#a92689",
		"sapUiChartPaletteSequentialHue8Dark2": "#921473",
		"sapUiChartPaletteSequentialHue9Light3": "#d1d9db",
		"sapUiChartPaletteSequentialHue9Light2": "#adbcc3",
		"sapUiChartPaletteSequentialHue9Light1": "#8ca2ab",
		"sapUiChartPaletteSequentialHue9": "#6c8893",
		"sapUiChartPaletteSequentialHue9Dark1": "#547582",
		"sapUiChartPaletteSequentialHue9Dark2": "#3c6372",
		"sapUiChartPaletteSequentialHue10Light3": "#fccaca",
		"sapUiChartPaletteSequentialHue10Light2": "#f8a6a6",
		"sapUiChartPaletteSequentialHue10Light1": "#f38787",
		"sapUiChartPaletteSequentialHue10": "#ee6868",
		"sapUiChartPaletteSequentialHue10Dark1": "#e14c4c",
		"sapUiChartPaletteSequentialHue10Dark2": "#d52f2f",
		"sapUiChartPaletteSequentialHue11Light3": "#85a1bb",
		"sapUiChartPaletteSequentialHue11Light2": "#698daf",
		"sapUiChartPaletteSequentialHue11Light1": "#4d79a2",
		"sapUiChartPaletteSequentialHue11": "#2f6497",
		"sapUiChartPaletteSequentialHue11Dark1": "#245a8e",
		"sapUiChartPaletteSequentialHue11Dark2": "#144a7f",
		"sapUiChartPaletteSequentialNeutralLight3": "#d6dadb",
		"sapUiChartPaletteSequentialNeutralLight2": "#bac1c4",
		"sapUiChartPaletteSequentialNeutralLight1": "#9ea8ad",
		"sapUiChartPaletteSequentialNeutral": "#848f94",
		"sapUiChartPaletteSequentialNeutralDark1": "#6a757b",
		"sapUiChartPaletteSequentialNeutralDark2": "#596368",
		"sapUiChartPaletteNoSemDiv1Light3": "#f3dec9",
		"sapUiChartPaletteNoSemDiv1Light2": "#e3cbb3",
		"sapUiChartPaletteNoSemDiv1Light1": "#c8ab8e",
		"sapUiChartPaletteNoSemDiv1": "#b08e6d",
		"sapUiChartPaletteNoSemDiv1Dark1": "#8e6c4b",
		"sapUiChartPaletteNoSemDiv1Dark2": "#754f2a",
		"sapUiChartPaletteMidArea": "#f2f2f2",
		"sapUiChoroplethBG": "#f7f7f8",
		"sapUiChoroplethRegionBorder": "#fff",
		"sapUiChoroplethRegionBG": "#bac1c4",
		"sapUiMapLegendBG": "rgba(255,255,255,0.56)",
		"sapUiMapLegendBorderColor": "#ccc",
		"sapUiShellHoverBackground": "#f80707",
		"sapUiShellActiveBackground": "#d50606",
		"sapUiShellActiveTextColor": "#fff",
		"sapUiShellHoverToggleBackground": "#8b0404",
		"sapUiShellContainerBackground": "#fff",
		"sapUiShellAltContainerBackground": "#e84b4b",
		"sapUiShellGroupTextColor": "#565656",
		"sapUiUx3ShellHeaderColor": "transparent",
		"sapUiUx3ShellBackgroundColor": "#eff4f9",
		"sapUiUx3ShellHoverColor": "#787878",
		"sapUiUx3ShellGradientBottom": "transparent",
		"sapUiUx3ShellGradientTop": "rgba(249,86,57,0.03)",
		"sapUiUx3ShellToolPaletteIconFontColor": "#889eb1",
		"sapUiUx3ExactLstExpandOffset": "-1 -2",
		"sapUiUx3ExactLstRootExpandOffset": "0 3",
		"sapUiUx3ExactLstContentTop": "25px",
		"sapUiLinkActive": "#0070b1",
		"sapUiLinkVisited": "#0070b1",
		"sapUiLinkHover": "#0070b1",
		"sapUiLinkInverted": "#7ed0ff",
		"sapUiNotificationBarBG": "rgba(51,51,51,0.98)",
		"sapUiNotifierSeparator": "#000",
		"sapUiNotifierSeparatorWidth": "1px",
		"sapUiNotificationBarBorder": "#666",
		"sapUiUx3ToolPopupInverted": "false",
		"sapUiUx3ToolPopupArrowRightMarginCorrection": "-1px",
		"sapUiUx3ToolPopupShadow": "0px 6px 12px 0px rgba(0,0,0,0.3)",
		"sapUiCalloutShadow": "0px 6px 12px 0px rgba(0,0,0,0.3)",
		"sapUiButtonIconColor": "#f80707",
		"sapUiButtonActiveBackground": "#f93939",
		"sapUiButtonActiveBorderColor": "#f93939",
		"sapUiButtonActiveTextColor": "#fff",
		"sapUiButtonEmphasizedHoverBackground": "#ff4c4c",
		"sapUiButtonEmphasizedHoverBorderColor": "#ff4c4c",
		"sapUiButtonEmphasizedActiveBackground": "#f93939",
		"sapUiButtonEmphasizedActiveBorderColor": "#f93939",
		"sapUiButtonEmphasizedTextShadow": "#000",
		"sapUiButtonAcceptBorderColor": "#2b7d2b",
		"sapUiButtonAcceptHoverBackground": "#f2f2f2",
		"sapUiButtonAcceptHoverBorderColor": "#2b7d2b",
		"sapUiButtonAcceptActiveBackground": "#2b7d2b",
		"sapUiButtonAcceptActiveBorderColor": "#2b7d2b",
		"sapUiButtonAcceptTextColor": "#2b7d2b",
		"sapUiButtonRejectBorderColor": "#bb0000",
		"sapUiButtonRejectHoverBackground": "#f2f2f2",
		"sapUiButtonRejectHoverBorderColor": "#bb0000",
		"sapUiButtonRejectActiveBackground": "#bb0000",
		"sapUiButtonRejectActiveBorderColor": "#bb0000",
		"sapUiButtonRejectTextColor": "#b00",
		"sapUiButtonLiteBackground": "transparent",
		"sapUiButtonLiteBorderColor": "transparent",
		"sapUiButtonLiteTextColor": "#f80707",
		"sapUiButtonLiteHoverBackground": "rgba(186,186,186,0.5)",
		"sapUiButtonLiteHoverBorderColor": "rgba(186,186,186,0.5)",
		"sapUiButtonLiteActiveBackground": "#f93939",
		"sapUiButtonLiteActiveBorderColor": "#f93939",
		"sapUiButtonHeaderTextColor": "#f80707",
		"sapUiButtonHeaderDisabledTextColor": "#f80707",
		"sapUiButtonFooterTextColor": "#f80707",
		"sapUiButtonFooterHoverBackground": "rgba(186,186,186,0.5)",
		"sapUiButtonActionSelectBackground": "#ffffff",
		"sapUiButtonActionSelectBorderColor": "rgba(229,229,229, 0.01)",
		"sapUiButtonLiteActionSelectHoverBackground": "#f0f0f0",
		"sapUiToggleButtonPressedBackground": "#f80707",
		"sapUiToggleButtonPressedBorderColor": "#df0606",
		"sapUiToggleButtonPressedTextColor": "#fff",
		"sapUiToggleButtonPressedHoverBackground": "#f93939",
		"sapUiToggleButtonPressedHoverBorderColor": "#f93939",
		"sapUiSegmentedButtonBackground": "#fff",
		"sapUiSegmentedButtonBorderColor": "#c7c7c7",
		"sapUiSegmentedButtonTextColor": "#f80707",
		"sapUiSegmentedButtonHoverBackground": "#f2f2f2",
		"sapUiSegmentedButtonActiveBackground": "#f93939",
		"sapUiSegmentedButtonActiveTextColor": "#fff",
		"sapUiSegmentedButtonSelectedBackground": "#f80707",
		"sapUiSegmentedButtonSelectedTextColor": "#fff",
		"sapUiSegmentedButtonSelectedHoverBackground": "#f93939",
		"sapUiSegmentedButtonSelectedHoverBorderColor": "#f93939",
		"sapUiSegmentedButtonIconColor": "#f80707",
		"sapUiSegmentedButtonActiveIconColor": "#fff",
		"sapUiSegmentedButtonSelectedIconColor": "#fff",
		"sapUiSegmentedButtonFooterBorderColor": "#c7c7c7",
		"sapUiSegmentedButtonFooterHoverBackground": "#f2f2f2",
		"sapUiFieldActiveBackground": "#f93939",
		"sapUiFieldActiveBorderColor": "#f93939",
		"sapUiFieldActiveTextColor": "#fff",
		"sapUiFieldPlaceholderTextColor": "#757575",
		"sapUiListTextColor": "#333333",
		"sapUiListVerticalBorderColor": "rgba(221,221,221,0.01)",
		"sapUiListActiveBackground": "#f93939",
		"sapUiListActiveTextColor": "#fff",
		"sapUiListSelectionHoverBackground": "#f7f7f7",
		"sapUiListFooterBackground": "#e8e8e8",
		"sapUiListFooterTextColor": "#333",
		"sapUiListGroupHeaderBackground": "#ffffff",
		"sapUiListTableGroupHeaderBackground": "#f2f2f2",
		"sapUiListTableGroupHeaderBorderColor": "rgba(204,204,204,0.01)",
		"sapUiListTableGroupHeaderTextColor": "#147575",
		"sapUiListTableFooterBorder": "rgba(204,204,204,0.01)",
		"sapUiListTableFixedBorder": "rgba(153,153,153,0.01)",
		"sapUiListTableTextSize": "0.875rem",
		"sapUiListTableIconSize": "1rem",
		"sapUiPageFooterBorderColor": "#ebebeb",
		"sapUiInfobarHoverBackground": "#147575",
		"sapUiInfobarActiveBackground": "#f93939",
		"sapUiObjectHeaderBorderColor": "#ebebeb",
		"sapUiCalendarColorToday": "#ab218e",
		"sapUiDragAndDropColor": "#878787",
		"sapUiDragAndDropBackground": "rgba(255,255,255,0.56)",
		"sapUiDragAndDropBorderColor": "#bfbfbf",
		"sapUiDragAndDropActiveColor": "#0070b1",
		"sapUiDragAndDropActiveBackground": "rgba(0,112,177,0.05)",
		"sapUiDragAndDropActiveBorderColor": "#0070b1",
		"sapUiShadowLevel0": "0 0 0 1px rgba(0,0,0,0.15)",
		"sapUiShadowLevel1": "0 0.125rem 0.5rem 0 rgba(0,0,0,0.15), 0 0 0 1px rgba(0,0,0,0.15)",
		"sapUiShadowLevel2": "0 0.625rem 1.875rem 0 rgba(0,0,0,0.15), 0 0 0 1px rgba(0,0,0,0.15)",
		"sapUiShadowLevel3": "0 1.25rem 5rem 0 rgba(0,0,0,0.15), 0 0 0 1px rgba(0,0,0,0.15)",
		"sapUiShadowText": "0 0 0.125rem #fff",
		"sapUiShadowHeader": "0 0.125rem 0 0 #ffffff, inset 0 -0.125rem 0 0 #ebebeb",
		"sapUiUx3ShellHeaderImageURL": "",
		"sapUiUx3ShellApplicationImageURL": "url('../../../../../../Base/baseLib/decortheme/img/misc/sapCompanyLogo.png')",
		"sapUiPurple": "purple",
		"sapUiOrange": "orange",
		"sapUiGreen": "green",
		"sapUiBlue": "blue",
		"sapUiRed": "red",
		"sapUiYellow": "yellow",
		"sapUiBase": "#000",
		"sapUiBaseBorder": "#000",
		"sapUiBaseLine": "#000",
		"sapUiWhite": "#FFFFFF",
		"sapUiWhiteBG": "#fff",
		"sapUiExtraLightBG": "rgba(255,255,255, 0.56)",
		"sapUiLightBG": "lightgray",
		"sapUiMediumBG": "gray",
		"sapUiDarkBG": "darkgray",
		"sapUiDeepBG": "black",
		"sapUiBlackBG": "#000000",
		"sapUiHoverBG": "grey",
		"sapUiMediumAltBG": "grey",
		"sapUiDarkAltBG": "darkgrey",
		"sapUiButtonStandardBG": "rgba(255,255,255, 0.56)",
		"sapUiButtonEmphasizedBG": "yellow",
		"sapUiButtonNegativeBG": "red",
		"sapUiButtonPositiveBG": "green",
		"sapUiReadOnlyBG": "grey",
		"sapUiExtraLightText": "lightgray",
		"sapUiLightText": "lightgray",
		"sapUiMediumText": "grey",
		"sapUiDarkText": "darkgrey",
		"sapUiDeepText": "black",
		"sapUiText": "#333333",
		"sapUiTextInverted": "#fff",
		"sapUiWhiteBorder": "#fff",
		"sapUiExtraLightBorder": "lightgrey",
		"sapUiLightBorder": "grey",
		"sapUiMediumBorder": "#000",
		"sapUiDarkBorder": "#000",
		"sapUiBlackBorder": "#000",
		"sapUiElement": "lightgrey",
		"sapUiInvertedElement": "#ffffff",
		"sapUiLightLine": "lightgrey",
		"sapUiMediumLine": "grey",
		"sapUiEmphasizedLine": "#f93939",
		"sapUiDarkLine": "darkgrey",
		"sapUiLightShadowTint": "#ffffff",
		"sapUiDarkShadowTint": "#000000",
		"sapUiFocus": "#000000",
		"sapUiInvertedFocus": "#ffffff",
		"sapUiTableRowBG": "#FFFFFF",
		"sapUiTableRowAlternatingBG": "#FFFFFF",
		"sapUiTableRowSelectionBG": "#f93939",
		"sapUiTableRowSelectionReadOnlyBG": "#f93939",
		"sapUiTableRowHoverBG": "grey",
		"sapUiListBG": "#f7f7f7",
		"sapUiTextColor": "green",
		"sapUiTextTitleColor": "green",
		"sapUiTextSelectionColor": "green",
		"sapUiTextDisabled": "#ccc",
		"sapUiTextSelection": "#fff",
		"sapUiTextfieldBackground": "#FFFFFF",
		"sapUiFontMonospaceFamily": "Lucida Console",
		"sapUiUx3ShellSideBarBaseWidth": "40px",
		"sapUiUx3ShellPaneOverflowButtonHeight": "120px",
		"sapUiUx3ExactLstCollapseWidth": "24px",
		"sapUiUx3ExactLstHeaderHeight": "25px",
		"sapUiNotificationBarBG_IE": "grey",
		"sapUiNotifierHoverColor": "#f93939",
		"sapUiNotificationText": "#fff",
		"sapUiNotificationTimestamp": "#ababab",
		"sapUiNotificationBarCalloutBorder": "rgba(128,128,128,0)",
		"sapUiNotificationBarCalloutBorder_IE": "grey",
		"sapUiNotificationBarCalloutArr": "rgba(51,51,51,0.98)",
		"sapUiNotificationBarHeight": "40px",
		"sapUiNotificationBarHeightMinimized": "0px",
		"sapUiNotificationBarHeightMaximized": "40%",
		"sapUiNotifierWidth": "40px",
		"sapUiRIIconPaddingXS": "1px",
		"sapUiRIIconPaddingS": "0.125rem",
		"sapUiRIIconPaddingM": "0.1875rem",
		"sapUiRIIconPaddingL": "0.25rem",
		"sapUiRIIconPaddingCozy": "0.1875rem",
		"sapUiRIIconPaddingCompact": "0.125rem",
		"sapUiRIIconPaddingCondensed": "0.125rem",
		"sapUiRIIconPaddingDisplayOnly": "0.125rem",
		"sapUiRIIconSizeCozy": "1.375rem",
		"sapUiRIIconSizeCompact": "1rem",
		"sapUiRIIconSizeCondensed": "1rem",
		"sapUiRIIconSizeDisplayOnly": "1rem",
		"sapUiUx3ToolPopupArrowWidth": "13px",
		"sapUiUx3ToolPopupArrowHeight": "24px",
		"sapUiUx3ToolPopupArrowRightMarginCorrectionInverted": "-7px",
		"sapUiUx3TPPaddingBottom": "50px",
		"sapUiButtonEmphasizedDisabledBorderColor": "#ff4c4c",
		"sapUiButtonEmphasizedDisabledBackground": "#f66",
		"sapUiButtonAcceptDisabledBorderColor": "#2b7d2b",
		"sapUiButtonAcceptDisabledBackground": "#ffffff",
		"sapUiButtonRejectDisabledBorderColor": "#bb0000",
		"sapUiButtonRejectDisabledBackground": "#ffffff",
		"sapUiToggleButtonPressedDisabledBackground": "#f80707",
		"sapUiToggleButtonPressedDisabledBorderColor": "#df0606",
		"sapUiToggleButtonPressedDisabledTextColor": "#fdc1c1",
		"sapUiPositiveBG": "#2b7d2b",
		"sapUiShadowTint": "#000",
		"sapUiShadow": "5px 5px 10px rgba(0,0,0,0.5)",
		"sapUiThemeDesignerCustomCss": "true",
		"sapUiMarginTiny": "0.5rem",
		"sapUiMarginSmall": "1rem",
		"sapUiMarginMedium": "2rem",
		"sapUiMarginLarge": "3rem",
		"sapUiEscapedEmptyString": "",
		"sapUiLightBoxMagnifyingGlassBorder": "none",
		"sapUiLightBoxMagnifyingGlassBackgroundColor": "#0070b1",
		"sapBackgroundColorDefault": "#fafafa",
		"sapPrimary1": "#3f5161",
		"sapPrimary2": "#427cac",
		"sapPrimary3": "#eff4f9",
		"sapPrimary4": "#ffffff",
		"sapPrimary5": "#fafafa",
		"sapPrimary6": "#bfbfbf",
		"sapPrimary7": "#333333",
		"sapAccentColor1": "#e09d00",
		"sapAccentColor2": "#e6600d",
		"sapAccentColor3": "#c14646",
		"sapAccentColor4": "#ab218e",
		"sapAccentColor5": "#678bc7",
		"sapAccentColor6": "#0092d1",
		"sapAccentColor7": "#1a9898",
		"sapAccentColor8": "#759421",
		"sapErrorBackground": "#ffe4e4",
		"sapWarningBackground": "#fef0db",
		"sapSuccessBackground": "#e4f6e4",
		"sapNeutralBackground": "#f4f5f6",
		"sapErrorBorderColor": "#e00",
		"sapWarningBorderColor": "#f9a429",
		"sapSuccessBorderColor": "#38a338",
		"sapNegativeTextColor": "#bb0000",
		"sapCriticalTextColor": "#e78c07",
		"sapPositiveTextColor": "#2b7d2b",
		"sapNeutralTextColor": "#5e696e",
		"sapErrorColor": "#e00",
		"sapWarningColor": "#f9a429",
		"sapSuccessColor": "#38a338",
		"sapShell_BackgroundPatternColor": "rgba(255,255,255,0.08)",
		"sapUiShellBackgroundPatternColor": "rgba(255,255,255,0.08)",
		"sapUiPrimary1": "#3f5161",
		"sapUiPrimary2": "#427cac",
		"sapUiPrimary3": "#eff4f9",
		"sapUiPrimary4": "#ffffff",
		"sapUiPrimary5": "#fafafa",
		"sapUiPrimary6": "#bfbfbf",
		"sapUiPrimary7": "#333333"
	},
	"scopes": {
		"sapContrast": {
			"sapBrandColor": "#427cac",
			"sapHighlightColor": "#d8d4d5",
			"sapBaseColor": "#000000",
			"sapBackgroundColor": "#000000",
			"sapTextColor": "#ffffff",
			"sapLinkColor": "#7ed0ff",
			"sapCompanyLogo": "none",
			"sapBackgroundImage": "none",
			"sapBackgroundImageOpacity": "1.0",
			"sapSelectedColor": "#d8d4d5",
			"sapActiveColor": "#d8d4d5",
			"sapHighlightTextColor": "#2f3c48",
			"sapTitleColor": "#ffffff",
			"sapNegativeColor": "#ff8888",
			"sapCriticalColor": "#fabd64",
			"sapPositiveColor": "#abe2ab",
			"sapNeutralColor": "#d3d7d9",
			"sapNegativeElementColor": "#ff8888",
			"sapCriticalElementColor": "#fabd64",
			"sapPositiveElementColor": "#abe2ab",
			"sapNeutralElementColor": "#d3d7d9",
			"sapContent_IconColor": "#f5f4f4",
			"sapContent_ContrastIconColor": "#2f3c48",
			"sapContent_NonInteractiveIconColor": "#595959",
			"sapContent_MarkerIconColor": "#8ca7d5",
			"sapContent_MarkerTextColor": "#7d7d7d",
			"sapContent_ImagePlaceholderBackground": "#333",
			"sapContent_ImagePlaceholderForegroundColor": "#0d0d0d",
			"sapContent_FocusColor": "#fff",
			"sapContent_ContrastFocusColor": "#000",
			"sapContent_SearchHighlightColor": "#058088",
			"sapContent_LabelColor": "#e2e2e2",
			"sapContent_DisabledTextColor": "rgba(255,255,255,0.5)",
			"sapContent_ContrastTextThreshold": "0.5",
			"sapContent_ContrastTextColor": "#2f3c48",
			"sapContent_ForegroundColor": "#121212",
			"sapContent_ForegroundBorderColor": "#4d4d4d",
			"sapContent_ForegroundTextColor": "#ffffff",
			"sapShell_Background": "#343434",
			"sapShell_BackgroundImage": "linear-gradient(to bottom, #000, #875555)",
			"sapShell_BackgroundGradient": "linear-gradient(to bottom, #000, #875555)",
			"sapShell_BackgroundImageOpacity": "1.0",
			"sapShell_TextColor": "#fff",
			"sapShell_Favicon": "none",
			"sapButton_Background": "#050505",
			"sapButton_BorderColor": "#616161",
			"sapButton_TextColor": "#f5f4f4",
			"sapButton_Hover_Background": "#141414",
			"sapButton_Hover_BorderColor": "#616161",
			"sapButton_Hover_TextColor": "#c0b9bb",
			"sapButton_Emphasized_Background": "#5496cd",
			"sapButton_Emphasized_BorderColor": "#408ac7",
			"sapButton_Reject_Background": "#050505",
			"sapButton_Accept_Background": "#050505",
			"sapField_Background": "#0d0d0d",
			"sapField_BorderColor": "#404040",
			"sapField_TextColor": "#fff",
			"sapField_HelpBackground": "#0d0d0d",
			"sapField_Hover_Background": "#0d0d0d",
			"sapField_Hover_BorderColor": "#d8d4d5",
			"sapField_Hover_HelpBackground": "#d8d4d5",
			"sapField_Focus_Background": "#0d0d0d",
			"sapField_Focus_BorderColor": "#404040",
			"sapField_Focus_HelpBackground": "#0d0d0d",
			"sapField_Disabled_TextColor": "rgba(255,255,255,0.5)",
			"sapField_ReadOnly_Background": "transparent",
			"sapField_ReadOnly_BorderColor": "#404040",
			"sapField_ReadOnly_HelpBackground": "transparent",
			"sapField_RequiredColor": "#d88b8b",
			"sapField_InvalidColor": "#ff8888",
			"sapField_InvalidBackground": "#0d0d0d",
			"sapField_WarningColor": "#fabd64",
			"sapField_WarningBackground": "#0d0d0d",
			"sapField_SuccessColor": "#abe2ab",
			"sapField_SuccessBackground": "#0d0d0d",
			"sapGroup_TitleBorderColor": "#333",
			"sapGroup_TitleTextColor": "#fff",
			"sapGroup_ContentBackground": "#000000",
			"sapGroup_ContentBorderColor": "#141414",
			"sapToolbar_SeparatorColor": "rgba(239,244,249,0.2)",
			"sapList_HeaderBackground": "#000",
			"sapList_HeaderBorderColor": "#121212",
			"sapList_HeaderTextColor": "#fff",
			"sapList_BorderColor": "#121212",
			"sapList_HighlightColor": "#8a8a8a",
			"sapList_SelectionBackgroundColor": "#1a1a1a",
			"sapList_Background": "#000000",
			"sapList_Hover_Background": "#080808",
			"sapScrollBar_FaceColor": "#0099db",
			"sapScrollBar_TrackColor": "#000000",
			"sapScrollBar_BorderColor": "#0099db",
			"sapScrollBar_SymbolColor": "#f5f4f4",
			"sapScrollBar_Hover_FaceColor": "#00a4ea",
			"sapPageHeader_Background": "#000000",
			"sapPageHeader_BorderColor": "#141414",
			"sapPageHeader_TextColor": "#ffffff",
			"sapPageFooter_Background": "#000",
			"sapPageFooter_TextColor": "#ffffff",
			"sapObjectHeader_Background": "#000000",
			"sapTile_Background": "#000000",
			"sapTile_TitleTextColor": "#ffffff",
			"sapTile_TextColor": "#e2e2e2",
			"sapTile_IconColor": "#d1cccc",
			"sapChart_Bad": "#f55556",
			"sapChart_Critical": "#f4ac44",
			"sapChart_Good": "#69c683",
			"sapChart_Neutral": "#9ea8ad",
			"sapChart_Sequence_Neutral": "#9ea8ad",
			"sapUiBrand": "#427cac",
			"sapUiHighlight": "#d8d4d5",
			"sapUiBaseColor": "#000000",
			"sapUiBaseBG": "#000000",
			"sapUiGlobalBackgroundColor": "#000000",
			"sapUiBaseText": "#ffffff",
			"sapUiLink": "#7ed0ff",
			"sapUiGlobalLogo": "none",
			"sapUiGlobalBackgroundImage": "none",
			"sapUiBackgroundImage": "none",
			"sapUiUx3ShellBackgroundImageURL": "none",
			"sapUiGlobalBackgroundImageOpacity": "1.0",
			"sapUiSelected": "#d8d4d5",
			"sapUiActive": "#d8d4d5",
			"sapUiHighlightTextColor": "#2f3c48",
			"sapUiTextTitle": "#ffffff",
			"sapUiContentIconColor": "#f5f4f4",
			"sapUiContentContrastIconColor": "#2f3c48",
			"sapUiContentNonInteractiveIconColor": "#595959",
			"sapUiContentMarkerIconColor": "#8ca7d5",
			"sapUiContentMarkerTextColor": "#7d7d7d",
			"sapUiContentImagePlaceholderBackground": "#333",
			"sapUiContentImagePlaceholderForegroundColor": "#0d0d0d",
			"sapUiContentFocusColor": "#fff",
			"sapUiContentContrastFocusColor": "#000",
			"sapUiContentSearchHighlightColor": "#058088",
			"sapUiContentLabelColor": "#e2e2e2",
			"sapUiContentDisabledTextColor": "rgba(255,255,255,0.5)",
			"sapUiContentContrastTextThreshold": "0.5",
			"sapUiContentContrastTextColor": "#2f3c48",
			"sapUiContentForegroundColor": "#121212",
			"sapUiContentForegroundBorderColor": "#4d4d4d",
			"sapUiContentForegroundTextColor": "#ffffff",
			"sapUiShellBackground": "#343434",
			"sapUiShellBackgroundImage": "linear-gradient(to bottom, #000, #875555)",
			"sapUiShellBackgroundImageOpacity": "1.0",
			"sapUiShellBackgroundGradient": "linear-gradient(to bottom, #000, #875555)",
			"sapUiShellTextColor": "#fff",
			"sapUiShellFavicon": "none",
			"sapUiButtonBackground": "#050505",
			"sapUiButtonBorderColor": "#616161",
			"sapUiButtonTextColor": "#f5f4f4",
			"sapUiButtonHoverBackground": "#141414",
			"sapUiButtonHoverBorderColor": "#616161",
			"sapUiButtonHoverTextColor": "#c0b9bb",
			"sapUiButtonEmphasizedBackground": "#5496cd",
			"sapUiButtonEmphasizedBorderColor": "#408ac7",
			"sapUiButtonRejectBackground": "#050505",
			"sapUiButtonAcceptBackground": "#050505",
			"sapUiFieldBackground": "#0d0d0d",
			"sapUiFieldBorderColor": "#404040",
			"sapUiFieldTextColor": "#fff",
			"sapUiFieldHelpBackground": "#0d0d0d",
			"sapUiFieldHoverBackground": "#0d0d0d",
			"sapUiFieldHoverBorderColor": "#d8d4d5",
			"sapUiFieldHoverHelpBackground": "#d8d4d5",
			"sapUiFieldFocusBackground": "#0d0d0d",
			"sapUiFieldFocusBorderColor": "#404040",
			"sapUiFieldFocusHelpBackground": "#0d0d0d",
			"sapUiFieldReadOnlyBackground": "transparent",
			"sapUiFieldReadOnlyBorderColor": "#404040",
			"sapUiFieldReadOnlyHelpBackground": "transparent",
			"sapUiFieldDisabledTextColor": "rgba(255,255,255,0.5)",
			"sapUiFieldRequiredColor": "#d88b8b",
			"sapUiFieldInvalidColor": "#ff8888",
			"sapUiFieldInvalidBackground": "#0d0d0d",
			"sapUiFieldWarningColor": "#fabd64",
			"sapUiFieldWarningBackground": "#0d0d0d",
			"sapUiFieldSuccessColor": "#abe2ab",
			"sapUiFieldSuccessBackground": "#0d0d0d",
			"sapUiGroupTitleBorderColor": "#333",
			"sapUiGroupTitleTextColor": "#fff",
			"sapUiGroupContentBackground": "#000000",
			"sapUiGroupContentBorderColor": "#141414",
			"sapUiToolbarSeparatorColor": "rgba(239,244,249,0.2)",
			"sapUiListHeaderBackground": "#000",
			"sapUiListHeaderBorderColor": "#121212",
			"sapUiListHeaderTextColor": "#fff",
			"sapUiListBorderColor": "#121212",
			"sapUiListHighlightColor": "#8a8a8a",
			"sapUiListSelectionBackgroundColor": "#1a1a1a",
			"sapUiListBackground": "#000000",
			"sapUiListHoverBackground": "#080808",
			"sapUiScrollBarFaceColor": "#0099db",
			"sapUiScrollBarTrackColor": "#000000",
			"sapUiScrollBarBorderColor": "#0099db",
			"sapUiScrollBarSymbolColor": "#f5f4f4",
			"sapUiScrollBarHoverFaceColor": "#00a4ea",
			"sapUiPageHeaderBackground": "#000000",
			"sapUiPageHeaderBorderColor": "#141414",
			"sapUiPageHeaderTextColor": "#ffffff",
			"sapUiPageFooterBackground": "#000",
			"sapUiPageFooterTextColor": "#ffffff",
			"sapUiObjectHeaderBackground": "#000000",
			"sapUiTileBackground": "#000000",
			"sapUiTileTitleTextColor": "#ffffff",
			"sapUiTileTextColor": "#e2e2e2",
			"sapUiTileIconColor": "#d1cccc",
			"sapUiChartBad": "#f55556",
			"sapUiChartCritical": "#f4ac44",
			"sapUiChartGood": "#69c683",
			"sapUiChartNeutral": "#9ea8ad",
			"sapUiChartSequenceNeutral": "#9ea8ad",
			"sapUiErrorBG": "#500",
			"sapUiWarningBG": "#5c3803",
			"sapUiSuccessBG": "#174417",
			"sapUiNeutralBG": "#393e41",
			"sapUiErrorBorder": "#ff8888",
			"sapUiWarningBorder": "#fabd64",
			"sapUiSuccessBorder": "#abe2ab",
			"sapUiNeutralBorder": "#d3d7d9",
			"sapUiNegativeElement": "#ff8888",
			"sapUiCriticalElement": "#fabd64",
			"sapUiPositiveElement": "#abe2ab",
			"sapUiNeutralElement": "#d3d7d9",
			"sapUiNegativeText": "#ff8888",
			"sapUiCriticalText": "#fabd64",
			"sapUiPositiveText": "#abe2ab",
			"sapUiNeutralText": "#d3d7d9",
			"sapUiNegative": "#ff8888",
			"sapUiCritical": "#fabd64",
			"sapUiPositive": "#abe2ab",
			"sapUiNeutral": "#d3d7d9",
			"sapUiErrorColor": "#fbb",
			"sapUiWarningColor": "#fcd295",
			"sapUiSuccessColor": "#d1efd1",
			"sapUiChartLabelHoverColor": "#141414",
			"sapUiChartLabelPressedColor": "#8a8a8a",
			"sapUiChartCategoryAxisLabelFontColor": "#ffffff",
			"sapUiChartValueAxisLabelFontColor": "#ffffff",
			"sapUiChartCategoryAxisLineColor": "#7c7c7c",
			"sapUiChartValueAxisLineColor": "#7c7c7c",
			"sapUiChartCategoryAxisTickColor": "#7c7c7c",
			"sapUiChartValueAxisTickColor": "#7c7c7c",
			"sapUiChartLegendLabelFontColor": "#ffffff",
			"sapUiChartLegendTitleFontColor": "#fff",
			"sapUiChartPaletteUndefinedColor": "#ffffff",
			"sapUiChartGridlineColor": "#494949",
			"sapUiChartReferenceLineColor": "#afafaf",
			"sapUiChartDataLabelFontColor": "#ffffff",
			"sapUiChartReferenceLineLabelColor": "#2f3c48",
			"sapUiChartPopoverDataItemFontColor": "#ffffff",
			"sapUiChartPopoverGroupFontColor": "#ffffff",
			"sapUiChartScrollBarThumbColor": "#0099db",
			"sapUiChartScrollBarTrackColor": "#000000",
			"sapUiChartScrollBarThumbHoverColor": "#00a4ea",
			"sapUiChartMainTitleFontColor": "#fff",
			"sapUiChartAxisTitleFontColor": "#fff",
			"sapUiChartLightText": "#ffffff",
			"sapUiChartZeroAxisColor": "#afafaf",
			"sapUiChartDataPointBorderColor": "#000000",
			"sapUiChartDataPointBorderHoverSelectedColor": "#afafaf",
			"sapUiChartDataPointNotSelectedBackgroundOpacity": "0.7",
			"sapUiChartCategoryAxisLabelFontHoverColor": "#ffffff",
			"sapUiChartCategoryAxisLabelFontPressedColor": "#ffffff",
			"sapUiChartTargetColor": "#afafaf",
			"sapUiChartTargetShadowColor": "#000",
			"sapUiChartBubbleBGOpacity": "0.9",
			"sapUiChartScrollbarBorderColor": "#0099db",
			"sapUiChartNegativeLargeText": "#f77c7c",
			"sapUiChartCriticalLargeText": "#f7c174",
			"sapUiChartPositiveLargeText": "#a0dbb1",
			"sapUiChartNeutralLargeText": "#f1f2f3",
			"sapUiChartDataPointBG": "#848f94",
			"sapUiChartDataPointBGBorderColor": "#848f94",
			"sapUiChartDataLineColorWithBG": "#000",
			"sapUiChartDataLineColor": "#afafaf",
			"sapUiChartRadialRemainingCircle": "#848f94",
			"sapUiChartRadialRemainingCircleBorderColor": "#848f94",
			"sapUiChartRadialBG": "transparent",
			"sapUiChartLegendHoverBackground": "#080808",
			"sapUiChartLegendSelectionBackground": "#1a1a1a",
			"sapUiChartLegendSelectionHoverBackground": "#222",
			"sapUiChartPaletteSemanticBadLight3": "#fbc4c4",
			"sapUiChartPaletteSemanticBadLight2": "#f99d9e",
			"sapUiChartPaletteSemanticBadLight1": "#f77c7c",
			"sapUiChartPaletteSemanticBad": "#f55556",
			"sapUiChartPaletteSemanticBadDark1": "#f33334",
			"sapUiChartPaletteSemanticBadDark2": "#ef0e0f",
			"sapUiChartPaletteSemanticCriticalLight3": "#fdecd5",
			"sapUiChartPaletteSemanticCriticalLight2": "#fad7a4",
			"sapUiChartPaletteSemanticCriticalLight1": "#f7c174",
			"sapUiChartPaletteSemanticCritical": "#f4ac44",
			"sapUiChartPaletteSemanticCriticalDark1": "#f19714",
			"sapUiChartPaletteSemanticCriticalDark2": "#de890d",
			"sapUiChartPaletteSemanticGoodLight3": "#d8f0df",
			"sapUiChartPaletteSemanticGoodLight2": "#b3e2c0",
			"sapUiChartPaletteSemanticGoodLight1": "#8ed4a2",
			"sapUiChartPaletteSemanticGood": "#69c683",
			"sapUiChartPaletteSemanticGoodDark1": "#45b765",
			"sapUiChartPaletteSemanticGoodDark2": "#3fa45b",
			"sapUiChartPaletteSemanticNeutralLight3": "#f1f2f3",
			"sapUiChartPaletteSemanticNeutralLight2": "#d5dadc",
			"sapUiChartPaletteSemanticNeutralLight1": "#bac1c4",
			"sapUiChartPaletteSemanticNeutral": "#9ea8ad",
			"sapUiChartPaletteSemanticNeutralDark1": "#848f94",
			"sapUiChartPaletteSemanticNeutralDark2": "#69767c",
			"sapUiChartPaletteSequentialNeutralLight3": "#f1f2f3",
			"sapUiChartPaletteSequentialNeutralLight2": "#d5dadc",
			"sapUiChartPaletteSequentialNeutralLight1": "#bac1c4",
			"sapUiChartPaletteSequentialNeutral": "#9ea8ad",
			"sapUiChartPaletteSequentialNeutralDark1": "#848f94",
			"sapUiChartPaletteSequentialNeutralDark2": "#69767c",
			"sapUiChartPaletteMidArea": "#fff",
			"sapUiChoroplethBG": "#7999a9",
			"sapUiChoroplethRegionBorder": "#afafaf",
			"sapUiChoroplethRegionBG": "#d5dadc",
			"sapUiMapLegendBG": "#000000",
			"sapUiMapLegendBorderColor": "#afafaf",
			"sapUiShellHoverBackground": "#eff4f9",
			"sapUiShellActiveBackground": "#eff4f9",
			"sapUiShellActiveTextColor": "#2e5778",
			"sapUiShellHoverToggleBackground": "#fff",
			"sapUiShellContainerBackground": "#a36c6c",
			"sapUiShellAltContainerBackground": "#000",
			"sapUiShellGroupTextColor": "#fff",
			"sapUiUx3ShellGradientTop": "rgba(216,212,212,0.03)",
			"sapUiLinkActive": "#7ed0ff",
			"sapUiLinkVisited": "#7ed0ff",
			"sapUiLinkHover": "#7ed0ff",
			"sapUiLinkInverted": "#fff",
			"sapUiButtonIconColor": "#f5f4f4",
			"sapUiButtonActiveBackground": "#d8d4d5",
			"sapUiButtonActiveBorderColor": "#d8d4d5",
			"sapUiButtonActiveTextColor": "#2f3c48",
			"sapUiButtonEmphasizedHoverBackground": "#408ac7",
			"sapUiButtonEmphasizedHoverBorderColor": "#408ac7",
			"sapUiButtonEmphasizedActiveBackground": "#d8d4d5",
			"sapUiButtonEmphasizedActiveBorderColor": "#d8d4d5",
			"sapUiButtonAcceptBorderColor": "#abe2ab",
			"sapUiButtonAcceptHoverBackground": "#141414",
			"sapUiButtonAcceptHoverBorderColor": "#abe2ab",
			"sapUiButtonAcceptActiveBackground": "#abe2ab",
			"sapUiButtonAcceptActiveBorderColor": "#abe2ab",
			"sapUiButtonAcceptTextColor": "#abe2ab",
			"sapUiButtonRejectBorderColor": "#ff8888",
			"sapUiButtonRejectHoverBackground": "#141414",
			"sapUiButtonRejectHoverBorderColor": "#ff8888",
			"sapUiButtonRejectActiveBackground": "#ff8888",
			"sapUiButtonRejectActiveBorderColor": "#ff8888",
			"sapUiButtonRejectTextColor": "#f88",
			"sapUiButtonLiteTextColor": "#f5f4f4",
			"sapUiButtonLiteHoverBackground": "rgba(46,46,46,0.5)",
			"sapUiButtonLiteHoverBorderColor": "rgba(46,46,46,0.5)",
			"sapUiButtonLiteActiveBackground": "#d8d4d5",
			"sapUiButtonLiteActiveBorderColor": "#d8d4d5",
			"sapUiButtonHeaderTextColor": "#f5f4f4",
			"sapUiButtonHeaderDisabledTextColor": "#f5f4f4",
			"sapUiButtonFooterTextColor": "#f5f4f4",
			"sapUiButtonFooterHoverBackground": "rgba(46,46,46,0.5)",
			"sapUiButtonActionSelectBackground": "#000",
			"sapUiButtonActionSelectBorderColor": "#121212",
			"sapUiButtonLiteActionSelectHoverBackground": "#000",
			"sapUiToggleButtonPressedBackground": "#c0b9bb",
			"sapUiToggleButtonPressedBorderColor": "#b4acae",
			"sapUiToggleButtonPressedTextColor": "#2f3c48",
			"sapUiToggleButtonPressedHoverBackground": "#d8d4d5",
			"sapUiToggleButtonPressedHoverBorderColor": "#d8d4d5",
			"sapUiSegmentedButtonBackground": "#050505",
			"sapUiSegmentedButtonBorderColor": "#484848",
			"sapUiSegmentedButtonTextColor": "#f5f4f4",
			"sapUiSegmentedButtonHoverBackground": "#141414",
			"sapUiSegmentedButtonActiveBackground": "#d8d4d5",
			"sapUiSegmentedButtonActiveTextColor": "#2f3c48",
			"sapUiSegmentedButtonSelectedBackground": "#c0b9bb",
			"sapUiSegmentedButtonSelectedTextColor": "#2f3c48",
			"sapUiSegmentedButtonSelectedHoverBackground": "#d8d4d5",
			"sapUiSegmentedButtonSelectedHoverBorderColor": "#d8d4d5",
			"sapUiSegmentedButtonIconColor": "#f5f4f4",
			"sapUiSegmentedButtonActiveIconColor": "#2f3c48",
			"sapUiSegmentedButtonSelectedIconColor": "#2f3c48",
			"sapUiSegmentedButtonFooterBorderColor": "#616161",
			"sapUiSegmentedButtonFooterHoverBackground": "#141414",
			"sapUiFieldActiveBackground": "#d8d4d5",
			"sapUiFieldActiveBorderColor": "#d8d4d5",
			"sapUiFieldActiveTextColor": "#2f3c48",
			"sapUiFieldPlaceholderTextColor": "#868686",
			"sapUiListTextColor": "#ffffff",
			"sapUiListVerticalBorderColor": "#1a1a1a",
			"sapUiListActiveBackground": "#8a8a8a",
			"sapUiListActiveTextColor": "#2f3c48",
			"sapUiListSelectionHoverBackground": "#222",
			"sapUiListFooterBackground": "#000",
			"sapUiListFooterTextColor": "#ffffff",
			"sapUiListGroupHeaderBackground": "#000000",
			"sapUiListTableGroupHeaderBackground": "#000",
			"sapUiListTableGroupHeaderBorderColor": "#333",
			"sapUiListTableGroupHeaderTextColor": "#7d7d7d",
			"sapUiListTableFooterBorder": "#333",
			"sapUiListTableFixedBorder": "#5f5f5f",
			"sapUiPageFooterBorderColor": "#1f1f1f",
			"sapUiInfobarActiveBackground": "#8a8a8a",
			"sapUiObjectHeaderBorderColor": "#141414",
			"sapUiCalendarColorToday": "#e57acf",
			"sapUiDragAndDropColor": "#595959",
			"sapUiDragAndDropBackground": "#000000",
			"sapUiDragAndDropBorderColor": "#4d4d4d",
			"sapUiDragAndDropActiveColor": "#7ed0ff",
			"sapUiDragAndDropActiveBackground": "rgba(126,208,255,0.1)",
			"sapUiDragAndDropActiveBorderColor": "#7ed0ff",
			"sapUiShadowLevel0": "0 0 0 1px rgba(255,255,255,0.2)",
			"sapUiShadowLevel1": "0 0.125rem 0.5rem 0 rgba(0,0,0,0.2), 0 0 0 1px rgba(255,255,255,0.2)",
			"sapUiShadowLevel2": "0 0.625rem 1.875rem 0 rgba(0,0,0,0.2), 0 0 0 1px rgba(255,255,255,0.2)",
			"sapUiShadowLevel3": "0 1.25rem 5rem 0 rgba(0,0,0,0.2), 0 0 0 1px rgba(255,255,255,0.2)",
			"sapUiShadowText": "0 0 0.125rem #000",
			"sapUiShadowHeader": "0 0.125rem 0 0 #000000, inset 0 -0.125rem 0 0 #141414",
			"sapUiUx3ShellHeaderImageURL": "",
			"sapUiUx3ShellApplicationImageURL": "none",
			"sapUiExtraLightBG": "#000000",
			"sapUiButtonStandardBG": "#000000",
			"sapUiText": "#ffffff",
			"sapUiEmphasizedLine": "#d8d4d5",
			"sapUiTableRowSelectionBG": "#d8d4d5",
			"sapUiTableRowSelectionReadOnlyBG": "#d8d4d5",
			"sapUiTextDisabled": "#fff",
			"sapUiNotifierHoverColor": "#d8d4d5",
			"sapUiNotificationTimestamp": "#fff",
			"sapUiButtonEmphasizedDisabledBorderColor": "#408ac7",
			"sapUiButtonEmphasizedDisabledBackground": "#5496cd",
			"sapUiButtonAcceptDisabledBorderColor": "#abe2ab",
			"sapUiButtonAcceptDisabledBackground": "#050505",
			"sapUiButtonRejectDisabledBorderColor": "#ff8888",
			"sapUiButtonRejectDisabledBackground": "#050505",
			"sapUiToggleButtonPressedDisabledBackground": "#c0b9bb",
			"sapUiToggleButtonPressedDisabledBorderColor": "#b4acae",
			"sapUiToggleButtonPressedDisabledTextColor": "#fdfcfc",
			"sapUiPositiveBG": "#abe2ab",
			"sapUiThemeDesignerCustomCss": "false",
			"sapUiEscapedEmptyString": "",
			"sapUiLightBoxMagnifyingGlassBackgroundColor": "#7ed0ff",
			"sapBackgroundColorDefault": "#3f5161",
			"sapErrorBackground": "#500",
			"sapWarningBackground": "#5c3803",
			"sapSuccessBackground": "#174417",
			"sapNeutralBackground": "#393e41",
			"sapErrorBorderColor": "#ff8888",
			"sapWarningBorderColor": "#fabd64",
			"sapSuccessBorderColor": "#abe2ab",
			"sapNegativeTextColor": "#ff8888",
			"sapCriticalTextColor": "#fabd64",
			"sapPositiveTextColor": "#abe2ab",
			"sapNeutralTextColor": "#d3d7d9",
			"sapErrorColor": "#ff8888",
			"sapWarningColor": "#fabd64",
			"sapSuccessColor": "#abe2ab"
		}
	}
}