{
	"zipInfo": {
		"creatorName": "Theming Engine",
		"creatorVersion": "1.32.6",
		"created": "2018-04-26T18:24:51Z",
		"lessVersion": "1.6.3",
		"compression": "none",
		"exportMode": "ALL_LOCAL"
	},
	"contentInfo": {
		"sourcePath": "https://webidetesting1837403-p1942301772trial.dispatcher.hanatrial.ondemand.com/themedesigner/theming/repository/~v=Base:11.0.13,UR:10.30.7.301056.0,UI5:1.54.3",
		"frameworks": {
			"UR": {
				"version": "10.30.7.301056.0"
			},
			"UI5": {
				"version": "1.54.3"
			},
			"Base": {
				"version": "11.0.13"
			}
		},
		"libraries": {
			"UR.baseLib": {
				"version": "10.30.7.301056.0"
			},
			"UR.flash": {
				"version": "10.30.7.301056.0"
			},
			"UR.ls": {
				"version": "10.30.7.301056.0"
			},
			"UR.silverlight": {
				"version": "10.30.7.301056.0"
			},
			"UI5.sap/ca/ui": {
				"version": "1.54.0"
			},
			"UI5.sap/f": {
				"version": "1.54.3"
			},
			"UI5.sap/fileviewer": {
				"version": "1.54.0"
			},
			"UI5.sap/fiori": {
				"version": "1.54.3"
			},
			"UI5.sap/gantt": {
				"version": "1.54.2"
			},
			"UI5.sap/m": {
				"version": "1.54.3"
			},
			"UI5.sap/me": {
				"version": "1.54.3"
			},
			"UI5.sap/ovp": {
				"version": "1.54.3"
			},
			"UI5.sap/rules/ui": {
				"version": "1.54.3"
			},
			"UI5.sap/suite/ui/commons": {
				"version": "1.54.3"
			},
			"UI5.sap/suite/ui/generic/template": {
				"version": "1.54.3"
			},
			"UI5.sap/suite/ui/microchart": {
				"version": "1.54.3"
			},
			"UI5.sap/tnt": {
				"version": "1.54.3"
			},
			"UI5.sap/ui/codeeditor": {
				"version": "1.54.3"
			},
			"UI5.sap/ui/commons": {
				"version": "1.54.3"
			},
			"UI5.sap/ui/comp": {
				"version": "1.54.3"
			},
			"UI5.sap/ui/core": {
				"version": "1.54.3"
			},
			"UI5.sap/ui/dt": {
				"version": "1.54.3"
			},
			"UI5.sap/ui/export": {
				"version": "1.54.3"
			},
			"UI5.sap/ui/fl": {
				"version": "1.54.3"
			},
			"UI5.sap/ui/layout": {
				"version": "1.54.3"
			},
			"UI5.sap/ui/mdc": {
				"version": "1.54.3"
			},
			"UI5.sap/ui/richtexteditor": {
				"version": "1.54.3"
			},
			"UI5.sap/ui/rta": {
				"version": "1.54.3"
			},
			"UI5.sap/ui/suite": {
				"version": "1.54.3"
			},
			"UI5.sap/ui/table": {
				"version": "1.54.3"
			},
			"UI5.sap/ui/unified": {
				"version": "1.54.3"
			},
			"UI5.sap/ui/ux3": {
				"version": "1.54.3"
			},
			"UI5.sap/ui/vbm": {
				"version": "1.54.2"
			},
			"UI5.sap/ui/vk": {
				"version": "1.54.4"
			},
			"UI5.sap/ui/vtm": {
				"version": "1.54.0"
			},
			"UI5.sap/ushell": {
				"version": "1.54.3"
			},
			"UI5.sap/uxap": {
				"version": "1.54.3"
			},
			"UI5.sap/viz": {
				"version": "1.54.3"
			},
			"UI5.sap/zen/commons": {
				"version": "1.54.3"
			},
			"UI5.sap/zen/crosstab": {
				"version": "1.54.3"
			},
			"Base.baseLib": {
				"version": "11.0.13"
			}
		},
		"themes": {
			"decortheme": {
				"id": "decortheme",
				"extends": "sap_belize",
				"label": "decortheme",
				"vendor": "Franz Portocarrero La Torre",
				"textDirections": "LTR"
			},
			"decortheme--Contrast": {
				"id": "decortheme--Contrast",
				"extends": "sap_belize_plus",
				"label": "",
				"vendor": "Franz Portocarrero La Torre",
				"textDirections": ""
			}
		}
	}
}