{
    "name": "Gtion.Plugin.CustomInspector.FieldInterface.Editor",
    "references": [
        "GUID:8cc2c7c6e89ce4846bf8f7103057e4f8"
    ],
    "includePlatforms": [
        "Editor"
    ],
    "excludePlatforms": [],
    "allowUnsafeCode": false,
    "overrideReferences": false,
    "precompiledReferences": [],
    "autoReferenced": true,
    "defineConstraints": [],
    "versionDefines": [],
    "noEngineReferences": false
}