{
    "name": "GDC.Innovation.Scriptable.Editor",
    "rootNamespace": "GDC.Innovation.Scriptable.Editor",
    "references": [
        "GUID:f24cf67903b27ae498b3069ecc30cc11",
        "GUID:ed1e8dad258cb9e4c8bd87d66c45d2fa"
    ],
    "includePlatforms": [
        "Editor"
    ],
    "excludePlatforms": [],
    "allowUnsafeCode": false,
    "overrideReferences": false,
    "precompiledReferences": [],
    "autoReferenced": true,
    "defineConstraints": [],
    "versionDefines": [],
    "noEngineReferences": false
}