﻿Model type;# Hidden layers;# Neurons/filters in the first layer;Image resolution;Timestamp;Accuracy
ANN;3;200;50;20220710163859;88.51%
CNN;3;32;50;20220710174414;94.96%
ANN;3;200;25;20220711162536;87.85%
CNN;3;32;25;20220711163358;96.11%
