{
  "initializeCommand": "${localWorkspaceFolder}/init_host.sh", // executed on HOST system

  "dockerComposeFile": "docker-compose.yml",
  "service": "devcontainer",
  "workspaceFolder": "/workspace",


  "mounts": [
    "source=/var/tmp/container-extensions,target=/home/dev/.vscode-server/extensions,type=bind,consistency=cached"
  ],
  "postCreateCommand": "./init_container.sh",


  // Configure tool-specific properties.
  "customizations": {
    "vscode": {
      "extensions": [
        "ms-python.python",
        "ms-python.vscode-pylance",
        "shardulm94.trailing-spaces",
        "njpwerner.autodocstring",
        "mhutchie.git-graph",
        "doi.fileheadercomment",
        "donjayamanne.githistory"
      ]
    }
  }

  // Uncomment to connect as root instead. More info: https://aka.ms/dev-containers-non-root.
  // "remoteUser": "root"
}
