{
  "initializeCommand": "${localWorkspaceFolder}/init_host.sh", // executed on HOST system

  // use Dockerfile
  "context": "../docker",
  "dockerFile": "../docker/Dockerfile.sys",

  // Or use a pre-built image
  // "image": "registry.gitlab.com/roxautomation/components/gamepad/gamepad:sys",

  "runArgs": [
    "--privileged",
    "--network=host",
    "--device=/dev/input",
    "--device=/dev/bus/usb"
  ],
  "mounts": [
    "source=/var/tmp/container-extensions,target=/home/dev/.vscode-server/extensions,type=bind,consistency=cached",
    "source=/dev/input,target=/dev/input,type=bind",
    "source=/dev/bus/usb,target=/dev/bus/usb,type=bind"
  ],
  // "postCreateCommand": "./init_container.sh",

  "containerEnv": {
    "ENV_VAR": "foo"
  },

  // Configure tool-specific properties.
  "customizations": {
    "vscode": {
      "extensions": [
        "ms-python.python",
        "ms-python.vscode-pylance",
        "shardulm94.trailing-spapces",
        "njpwerner.autodocstring",
        "mhutchie.git-graph",
        "doi.fileheadercomment",
        "donjayamanne.githistory"
      ]
    }
  }

  // Uncomment to connect as root instead. More info: https://aka.ms/dev-containers-non-root.
  // "remoteUser": "root"
}
