<svg id="phone-line" xmlns="http://www.w3.org/2000/svg" width="32" height="32" viewBox="0 0 32 32">
  <path id="Tracé_3401" data-name="Tracé 3401" d="M0,0H32V32H0Z" fill="none"/>
  <path id="Tracé_3402" data-name="Tracé 3402" d="M11.488,13.243a14.075,14.075,0,0,0,5.269,5.269l1.179-1.651a1.333,1.333,0,0,1,1.725-.395,15.229,15.229,0,0,0,6.111,1.819A1.333,1.333,0,0,1,27,19.615v5.949a1.333,1.333,0,0,1-1.2,1.327A20.679,20.679,0,0,1,3.109,4.2,1.333,1.333,0,0,1,4.436,3h5.949a1.333,1.333,0,0,1,1.329,1.228,15.229,15.229,0,0,0,1.819,6.111,1.333,1.333,0,0,1-.395,1.725l-1.651,1.179Zm-3.363-.876,2.533-1.809A17.88,17.88,0,0,1,9.2,5.667H5.68c-.008.221-.012.444-.012.667a18,18,0,0,0,18,18c.223,0,.445,0,.667-.013V20.8a17.88,17.88,0,0,1-4.891-1.463l-1.809,2.533a16.589,16.589,0,0,1-2.117-1l-.077-.044a16.741,16.741,0,0,1-6.269-6.269l-.044-.077a16.589,16.589,0,0,1-1-2.117Z" transform="translate(1 1)" fill="#2fb29c"/>
</svg>
