<svg xmlns="http://www.w3.org/2000/svg" width="242" height="37.256" viewBox="0 0 242 37.256">
  <g id="Groupe_26" data-name="Groupe 26" transform="translate(653.058 -1610.574)">
    <path id="Tracé_1768" data-name="Tracé 1768" d="M-623.639,1629.2a2.363,2.363,0,0,1,.674,1.744v11.116a2.092,2.092,0,0,1-.744,1.721,17.322,17.322,0,0,1-11.4,4.047,17.358,17.358,0,0,1-9.093-2.465,17.724,17.724,0,0,1-6.488-6.744,19.146,19.146,0,0,1-2.372-9.442,18.926,18.926,0,0,1,2.372-9.372,17.956,17.956,0,0,1,6.488-6.744,17.245,17.245,0,0,1,9.093-2.488,18.07,18.07,0,0,1,6.116.93,18.355,18.355,0,0,1,5.233,3.07,2.2,2.2,0,0,1,.744.86,2.7,2.7,0,0,1,.186,1.047,1.975,1.975,0,0,1-.674,1.536,2.326,2.326,0,0,1-1.6.6,2.469,2.469,0,0,1-1.581-.6,13.548,13.548,0,0,0-3.721-2.35,12.9,12.9,0,0,0-4.7-.721,12.336,12.336,0,0,0-6.674,1.907,13.79,13.79,0,0,0-4.837,5.186,14.654,14.654,0,0,0-1.791,7.14,14.611,14.611,0,0,0,1.791,7.163,13.831,13.831,0,0,0,4.837,5.163,12.33,12.33,0,0,0,6.674,1.907,13.549,13.549,0,0,0,7.488-2.325v-8.28h-6.419a2.51,2.51,0,0,1-1.744-.6,1.97,1.97,0,0,1-.674-1.535,1.971,1.971,0,0,1,.674-1.535,2.515,2.515,0,0,1,1.744-.6h8.7A2.3,2.3,0,0,1-623.639,1629.2Z" transform="translate(0)" fill="#5379ba"/>
    <path id="Tracé_1769" data-name="Tracé 1769" d="M-594.976,1623.694a2.164,2.164,0,0,1,1.4,1.861,1.652,1.652,0,0,1-.047.465,1.8,1.8,0,0,1-1.861,1.488,3.858,3.858,0,0,1-.7-.093,18.406,18.406,0,0,0-3.023-.326,8.768,8.768,0,0,0-5.4,1.535,4.907,4.907,0,0,0-2.047,4.14v13.582a2.384,2.384,0,0,1-.58,1.721,2.317,2.317,0,0,1-1.745.6,2.378,2.378,0,0,1-1.72-.582,2.311,2.311,0,0,1-.6-1.744v-20.791a2.327,2.327,0,0,1,.6-1.721,2.328,2.328,0,0,1,1.72-.6,2.055,2.055,0,0,1,2.326,2.326v.884a9.824,9.824,0,0,1,3.443-2.558,10.445,10.445,0,0,1,4.372-.93A8.3,8.3,0,0,1-594.976,1623.694Z" transform="translate(-4.407 -1.306)" fill="#5379ba"/>
    <path id="Tracé_1770" data-name="Tracé 1770" d="M-566.031,1637.031a2.125,2.125,0,0,1-1.536.581H-585.24a8.186,8.186,0,0,0,2.953,5.256,9.126,9.126,0,0,0,5.977,2,9.037,9.037,0,0,0,2.907-.512,8.672,8.672,0,0,0,2.489-1.256,2.411,2.411,0,0,1,1.534-.511,2,2,0,0,1,1.4.464,2.034,2.034,0,0,1,.837,1.582,1.685,1.685,0,0,1-.744,1.4,12.882,12.882,0,0,1-3.931,2.047,14.045,14.045,0,0,1-4.488.791,14.026,14.026,0,0,1-6.837-1.651,11.97,11.97,0,0,1-4.72-4.581,13.008,13.008,0,0,1-1.7-6.651,13.743,13.743,0,0,1,1.6-6.674,11.6,11.6,0,0,1,4.464-4.6,12.753,12.753,0,0,1,6.489-1.651,11.7,11.7,0,0,1,6.186,1.581,10.429,10.429,0,0,1,4,4.419,14.574,14.574,0,0,1,1.4,6.512A1.947,1.947,0,0,1-566.031,1637.031Zm-16.488-8.116a8.348,8.348,0,0,0-2.675,4.977h15.489a8.254,8.254,0,0,0-2.326-4.977,6.829,6.829,0,0,0-4.977-1.861A8.041,8.041,0,0,0-582.519,1628.915Z" transform="translate(-6.701 -1.317)" fill="#5379ba"/>
    <path id="Tracé_1771" data-name="Tracé 1771" d="M-534.779,1637.031a2.125,2.125,0,0,1-1.536.581h-17.675a8.191,8.191,0,0,0,2.953,5.256,9.126,9.126,0,0,0,5.977,2,9.037,9.037,0,0,0,2.907-.512,8.673,8.673,0,0,0,2.489-1.256,2.409,2.409,0,0,1,1.534-.511,2,2,0,0,1,1.4.464,2.035,2.035,0,0,1,.838,1.582,1.684,1.684,0,0,1-.745,1.4,12.866,12.866,0,0,1-3.93,2.047,14.05,14.05,0,0,1-4.488.791,14.026,14.026,0,0,1-6.837-1.651,11.979,11.979,0,0,1-4.721-4.581,13.016,13.016,0,0,1-1.7-6.651,13.754,13.754,0,0,1,1.6-6.674,11.605,11.605,0,0,1,4.465-4.6,12.75,12.75,0,0,1,6.489-1.651,11.7,11.7,0,0,1,6.186,1.581,10.429,10.429,0,0,1,4,4.419,14.574,14.574,0,0,1,1.4,6.512A1.947,1.947,0,0,1-534.779,1637.031Zm-16.49-8.116a8.352,8.352,0,0,0-2.674,4.977h15.489a8.254,8.254,0,0,0-2.326-4.977,6.828,6.828,0,0,0-4.977-1.861A8.046,8.046,0,0,0-551.268,1628.915Z" transform="translate(-9.999 -1.317)" fill="#5379ba"/>
    <path id="Tracé_1772" data-name="Tracé 1772" d="M-506.148,1624.4a9.835,9.835,0,0,1,4,4.069,13.409,13.409,0,0,1,1.442,6.442v11.442a2.3,2.3,0,0,1-.674,1.7,2.3,2.3,0,0,1-1.7.674,2.3,2.3,0,0,1-1.7-.674,2.3,2.3,0,0,1-.674-1.7v-11.442a7.515,7.515,0,0,0-2.023-5.7,7.462,7.462,0,0,0-5.372-1.93,7.943,7.943,0,0,0-3.558.791,6.312,6.312,0,0,0-2.512,2.141,5.293,5.293,0,0,0-.907,3.022v13.116a2.346,2.346,0,0,1-.651,1.7,2.284,2.284,0,0,1-1.721.674,2.3,2.3,0,0,1-1.7-.674,2.3,2.3,0,0,1-.674-1.7v-20.744a2.283,2.283,0,0,1,.674-1.721,2.346,2.346,0,0,1,1.7-.651,2.329,2.329,0,0,1,1.721.651,2.329,2.329,0,0,1,.651,1.721v.512a10.339,10.339,0,0,1,3.535-2.3,11.731,11.731,0,0,1,4.372-.814A11.837,11.837,0,0,1-506.148,1624.4Z" transform="translate(-13.56 -1.312)" fill="#5379ba"/>
    <path id="Tracé_1773" data-name="Tracé 1773" d="M-487.909,1646.722a2.379,2.379,0,0,1-.674-1.721v-31.489a2.34,2.34,0,0,1,.7-1.721,2.284,2.284,0,0,1,1.674-.7,2.338,2.338,0,0,1,1.721.7,2.341,2.341,0,0,1,.7,1.721v29.07h16.837a2.342,2.342,0,0,1,1.722.7,2.338,2.338,0,0,1,.7,1.721,2.338,2.338,0,0,1-.7,1.721,2.343,2.343,0,0,1-1.722.7h-19.256A2.261,2.261,0,0,1-487.909,1646.722Z" transform="translate(-17.358 -0.055)" fill="#32a58b"/>
    <path id="Tracé_1774" data-name="Tracé 1774" d="M-455.073,1617a2.953,2.953,0,0,1-.907-2.163,2.953,2.953,0,0,1,.907-2.163,2.952,2.952,0,0,1,2.163-.906,2.952,2.952,0,0,1,2.163.906,2.953,2.953,0,0,1,.907,2.163,2.953,2.953,0,0,1-.907,2.163,2.953,2.953,0,0,1-2.163.907A2.953,2.953,0,0,1-455.073,1617Zm.465,29.814a2.3,2.3,0,0,1-.674-1.7v-20.7a2.283,2.283,0,0,1,.674-1.721,2.346,2.346,0,0,1,1.7-.651,2.329,2.329,0,0,1,1.721.651,2.329,2.329,0,0,1,.651,1.721v20.7a2.346,2.346,0,0,1-.651,1.7,2.283,2.283,0,0,1-1.721.675A2.3,2.3,0,0,1-454.608,1646.817Z" transform="translate(-20.799 -0.126)" fill="#32a58b"/>
    <path id="Tracé_1775" data-name="Tracé 1775" d="M-421.6,1624.4a9.835,9.835,0,0,1,4,4.069,13.4,13.4,0,0,1,1.442,6.442v11.442a2.3,2.3,0,0,1-.674,1.7,2.3,2.3,0,0,1-1.7.674,2.3,2.3,0,0,1-1.7-.674,2.3,2.3,0,0,1-.674-1.7v-11.442a7.515,7.515,0,0,0-2.023-5.7,7.462,7.462,0,0,0-5.372-1.93,7.943,7.943,0,0,0-3.558.791,6.312,6.312,0,0,0-2.512,2.141,5.293,5.293,0,0,0-.907,3.022v13.116a2.346,2.346,0,0,1-.651,1.7,2.284,2.284,0,0,1-1.721.674,2.3,2.3,0,0,1-1.7-.674,2.3,2.3,0,0,1-.674-1.7v-20.744a2.283,2.283,0,0,1,.674-1.721,2.346,2.346,0,0,1,1.7-.651,2.329,2.329,0,0,1,1.721.651,2.329,2.329,0,0,1,.651,1.721v.512a10.339,10.339,0,0,1,3.535-2.3,11.734,11.734,0,0,1,4.372-.814A11.837,11.837,0,0,1-421.6,1624.4Z" transform="translate(-22.483 -1.312)" fill="#32a58b"/>
    <path id="Tracé_1776" data-name="Tracé 1776" d="M-384.832,1645.466a2.156,2.156,0,0,1-.837,1.721,2.343,2.343,0,0,1-1.488.558,2.031,2.031,0,0,1-1.675-.837l-8.836-10.93-2.327,2.047v7.116a2.232,2.232,0,0,1-.627,1.651,2.234,2.234,0,0,1-1.651.628,2.234,2.234,0,0,1-1.652-.628,2.235,2.235,0,0,1-.627-1.651v-31.768a2.236,2.236,0,0,1,.627-1.651,2.234,2.234,0,0,1,1.652-.628,2.234,2.234,0,0,1,1.651.628,2.233,2.233,0,0,1,.627,1.651v18.93l11.3-10.093a1.971,1.971,0,0,1,1.442-.6,1.944,1.944,0,0,1,1.581.744,1.971,1.971,0,0,1,.6,1.442,1.94,1.94,0,0,1-.743,1.581l-8.559,7.628,9.023,11.07A1.985,1.985,0,0,1-384.832,1645.466Z" transform="translate(-26.226 -0.055)" fill="#32a58b"/>
  </g>
</svg>
