{
  "tutors": [
    {
      "first_name": "Brian",
      "last_name": "Costantino",
      "email": "costan96@students.rowan.edu",
      "major": "ECE",
      "subjects": [
        "C++",
        "Python",
        "Calculus I",
        "Calculus II",
        "Calculus III"
      ],
      "availability": {
        "monday": [
          "after 6PM"
        ],
        "wednesday": [
          "after 6PM"
        ],
        "tuesday": [
          "after 3PM"
        ],
        "thursday": [
          "after 5PM"
        ]
      }
    },
    {
      "first_name": "Nick",
      "last_name": "Kabala",
      "email": "kabalan9@students.rowan.edu",
      "major": "ECE",
      "subjects": [
        "Calculus I",
        "MEA",
        "PECA"
      ],
      "availability": {
        "monday": [
          "3:30PM-7PM"
        ],
        "thursday": [
          "9:30AM-Noon"
        ],
        "friday": [
          "11AM-3PM"
        ]
      }
    },
    {
      "first_name": "John",
      "last_name": "Newman",
      "email": "newman17@students.rowan.edu",
      "major": "ECE",
      "subjects": [
        "C++",
        "Intro to Digital Systems"
      ],
      "availability": {
        "monday": [
          "1PM-4:30PM"
        ],
        "saturday": [
          "11AM-2PM"
        ]
      }
    },
    {
      "first_name": "Nick",
      "last_name": "Steel",
      "email": "steeln93@students.rowan.edu",
      "major": "ME",
      "subjects": [
        "Java",
        "Chemistry I",
        "C++",
        "Calculus I"
      ],
      "availability": {
        "monday": [
          "1PM-8PM"
        ],
        "tuesday": [
          "10AM-Noon"
        ],
        "wednesday": [
          "1PM-4PM"
        ],
        "friday": [
          "11AM-3PM"
        ],
        "saturday": [
          "Anytime"
        ],
        "sunday": [
          "Anytime"
        ]
      }
    }
  ],
  "subjects": [
    {
      "name": "C++"
    },
    {
      "name": "Calculus I"
    },
    {
      "name": "Calculus II"
    },
    {
      "name": "Calculus III"
    },
    {
      "name": "Chemistry I"
    },
    {
      "name": "Intro to Digital Systems"
    },
    {
      "name": "Java"
    },
    {
      "name": "MEA"
    },
    {
      "name": "PECA"
    },
    {
      "name": "Python"
    }
  ]
}