{
    "dependencies": "forestry",
    "populate": {
        "apatite": {
            "distribution": "uniform",
            "generator": {
                "block": "forestry:resources",
                "material": "minecraft:stone",
                "cluster-size": 24
            },
            "cluster-count": 1,
            "chunk-chance": 3,
            "min-height": 40,
            "max-height": 128,
            "retrogen": "false",
            "biome": "all",
            "dimension": {
                "restriction": "blacklist",
                "value": [
                    -1,
                    1
                ]
            }
        }
    }
}
