{
    "dependencies": "nuclearcraft",
    "populate": {
        "beneath_thorium": {
            "distribution": "uniform",
            "generator": {
                "block": {
                    "name": "nuclearcraft:ore",
                    "metadata": 3
                },
                "material": "minecraft:stone",
                "cluster-size": 5
            },
            "cluster-count": 8,
            "min-height": 0,
            "max-height": 255,
            "retrogen": "false",
            "biome": "all",
            "dimension": {
                "restriction": "whitelist",
                "value": [
                    10
                ]
            }
        },
        "beneath_uranium": {
            "distribution": "uniform",
            "generator": {
                "block": {
                    "name": "nuclearcraft:ore",
                    "metadata": 4
                },
                "material": "minecraft:stone",
                "cluster-size": 4
            },
            "cluster-count": 8,
            "min-height": 0,
            "max-height": 255,
            "retrogen": "false",
            "biome": "all",
            "dimension": {
                "restriction": "whitelist",
                "value": [
                    10
                ]
            }
        },
        "beneath_boron": {
            "distribution": "uniform",
            "generator": {
                "block": {
                    "name": "nuclearcraft:ore",
                    "metadata": 5
                },
                "material": "minecraft:stone",
                "cluster-size": 5
            },
            "cluster-count": 11,
            "min-height": 0,
            "max-height": 255,
            "retrogen": "false",
            "biome": "all",
            "dimension": {
                "restriction": "whitelist",
                "value": [
                    10
                ]
            }
        },
        "beneath_lithium": {
            "distribution": "uniform",
            "generator": {
                "block": [
                    {
                        "name": "nuclearcraft:ore",
                        "metadata": 6,
                        "weight": 80
                    },
                    {
                        "name": "nuclearcraft:ore",
                        "metadata": 7,
                        "weight": 20
                    }
                ],
                "material": "minecraft:stone",
                "cluster-size": 6
            },
            "cluster-count": 6,
            "min-height": 0,
            "max-height": 255,
            "retrogen": "false",
            "biome": "all",
            "dimension": {
                "restriction": "whitelist",
                "value": [
                    10
                ]
            }
        },
        "beneath_magnesium": {
            "distribution": "uniform",
            "generator": {
                "block": [
                    {
                        "name": "nuclearcraft:ore",
                        "metadata": 7,
                        "weight": 90
                    },
                    {
                        "name": "nuclearcraft:ore",
                        "metadata": 6,
                        "weight": 10
                    }
                ],
                "material": "minecraft:stone",
                "cluster-size": 6
            },
            "cluster-count": 5,
            "min-height": 0,
            "max-height": 255,
            "retrogen": "false",
            "biome": "all",
            "dimension": {
                "restriction": "whitelist",
                "value": [
                    10
                ]
            }
        }
    }
}
