{
    "dependencies": "thaumcraft",
    "populate": {
        "beneath_amber": {
            "distribution": "uniform",
            "generator": {
                "block": "thaumcraft:ore_amber",
                "material": "minecraft:stone",
                "cluster-size": 3
            },
            "cluster-count": 11,
            "min-height": 0,
            "max-height": 255,
            "retrogen": "false",
            "biome": "all",
            "dimension": {
                "restriction": "whitelist",
                "value": [
                    10
                ]
            }
        },
        "beneath_cinnabar": {
            "distribution": "uniform",
            "generator": {
                "block": "thaumcraft:ore_cinnabar",
                "material": "minecraft:stone",
                "cluster-size": 3
            },
            "cluster-count": 8,
            "min-height": 0,
            "max-height": 255,
            "retrogen": "false",
            "biome": "all",
            "dimension": {
                "restriction": "whitelist",
                "value": [
                    10
                ]
            }
        }
    }
}
