{
    "dependencies": "thermalfoundation",
    "populate": {
        "beneath_oil_shale": {
            "distribution": "uniform",
            "generator": {
                "type": "geode",
                "block": [
                    {
                        "name": "thermalfoundation:ore_fluid",
                        "metadata": 1,
                        "weight": 80
                    },
                    {
                        "name": "minecraft:gravel",
                        "weight": 20
                    }
                ],
                "material": [
                    "minecraft:dirt",
                    "minecraft:gravel",
                    "minecraft:stone"
                ],
                "hollow": "true",
                "filler": "thermalfoundation:fluid_crude_oil",
                "crust": "minecraft:stone"
            },
            "cluster-count": 3,
            "chunk-chance": 50,
            "min-height": 0,
            "max-height": 255,
            "retrogen": "true",
            "biome": "all",
            "dimension": {
                "restriction": "whitelist",
                "value": [
                    10
                ]
            }
        }
    }
}
