{
    "dependencies": "abyssalcraft",
    "populate": {
        "coralium_ocean": {
            "distribution": "uniform",
            "generator": {
                "block": "abyssalcraft:coraliumore",
                "material": "minecraft:stone",
                "cluster-size": 8
            },
            "cluster-count": 12,
            "min-height": 12,
            "max-height": 40,
            "retrogen": "false",
            "biome": {
                "restriction": "whitelist",
                "value": [
                    {
                        "type": "dictionary",
                        "entry": "WATER"
                    }
                ]
            },
            "dimension": {
                "restriction": "whitelist",
                "value": [
                    0
                ]
            }
        },
        "coralium_swamp": {
            "distribution": "uniform",
            "generator": {
                "block": "abyssalcraft:coraliumore",
                "material": "minecraft:stone",
                "cluster-size": 6
            },
            "cluster-count": 8,
            "min-height": 12,
            "max-height": 40,
            "retrogen": "false",
            "biome": {
                "restriction": "whitelist",
                "value": [
                    {
                        "type": "dictionary",
                        "entry": "SWAMP"
                    }
                ]
            },
            "dimension": {
                "restriction": "whitelist",
                "value": [
                    0
                ]
            }
        },
        "nitre": {
            "distribution": "uniform",
            "generator": {
                "block": "abyssalcraft:nitreore",
                "material": "minecraft:stone",
                "cluster-size": 6
            },
            "cluster-count": 8,
            "min-height": 0,
            "max-height": 30,
            "retrogen": "false",
            "biome": "all",
            "dimension": {
                "restriction": "whitelist",
                "value": [
                    0
                ]
            }
        }
    }
}
