{
    "dependencies": "biomesoplenty",
    "populate": {
        "ruby": {
            "distribution": "uniform",
            "generator": {
                "block": {
                    "name": "biomesoplenty:gem_ore",
                    "metadata": 1
                },
                "material": "minecraft:stone",
                "cluster-size": 3
            },
            "cluster-count": 3,
            "min-height": 18,
            "max-height": 55,
            "retrogen": "false",
            "biome": "all",
            "dimension": {
                "restriction": "blacklist",
                "value": [
                    -1,
                    1,
                    10,
                    111
                ]
            }
        },
        "peridot": {
            "distribution": "uniform",
            "generator": {
                "block": {
                    "name": "biomesoplenty:gem_ore",
                    "metadata": 2
                },
                "material": "minecraft:stone",
                "cluster-size": 3
            },
            "cluster-count": 3,
            "min-height": 18,
            "max-height": 55,
            "retrogen": "false",
            "biome": "all",
            "dimension": {
                "restriction": "blacklist",
                "value": [
                    -1,
                    1,
                    10,
                    111
                ]
            }
        },
        "topaz": {
            "distribution": "uniform",
            "generator": {
                "block": {
                    "name": "biomesoplenty:gem_ore",
                    "metadata": 3
                },
                "material": "minecraft:stone",
                "cluster-size": 3
            },
            "cluster-count": 3,
            "min-height": 18,
            "max-height": 55,
            "retrogen": "false",
            "biome": "all",
            "dimension": {
                "restriction": "blacklist",
                "value": [
                    -1,
                    1,
                    10,
                    111
                ]
            }
        },
        "tanzanite": {
            "distribution": "uniform",
            "generator": {
                "block": {
                    "name": "biomesoplenty:gem_ore",
                    "metadata": 4
                },
                "material": "minecraft:stone",
                "cluster-size": 3
            },
            "cluster-count": 3,
            "min-height": 18,
            "max-height": 55,
            "retrogen": "false",
            "biome": "all",
            "dimension": {
                "restriction": "blacklist",
                "value": [
                    -1,
                    1,
                    10,
                    111
                ]
            }
        },
        "sapphire": {
            "distribution": "uniform",
            "generator": {
                "block": {
                    "name": "biomesoplenty:gem_ore",
                    "metadata": 6
                },
                "material": "minecraft:stone",
                "cluster-size": 3
            },
            "cluster-count": 3,
            "min-height": 18,
            "max-height": 55,
            "retrogen": "false",
            "biome": "all",
            "dimension": {
                "restriction": "blacklist",
                "value": [
                    -1,
                    1,
                    10,
                    111
                ]
            }
        },
        "bop_amber": {
            "distribution": "uniform",
            "generator": {
                "block": {
                    "name": "biomesoplenty:gem_ore",
                    "metadata": 7
                },
                "material": "minecraft:stone",
                "cluster-size": 3
            },
            "cluster-count": 3,
            "min-height": 18,
            "max-height": 55,
            "retrogen": "false",
            "biome": "all",
            "dimension": {
                "restriction": "blacklist",
                "value": [
                    -1,
                    1,
                    10,
                    111
                ]
            }
        },
        "nether_malachite": {
            "distribution": "uniform",
            "generator": {
                "block": {
                    "name": "biomesoplenty:gem_ore",
                    "metadata": 5
                },
                "material": "minecraft:stone",
                "cluster-size": 4
            },
            "cluster-count": 13,
            "min-height": 10,
            "max-height": 118,
            "retrogen": "false",
            "biome": {
                "restriction": "whitelist",
                "value": [
                    {
                        "type": "dictionary",
                        "entry": "NETHER"
                    }
                ]
            },
            "dimension": "all"
        },
        "ender_amethyst": {
            "distribution": "uniform",
            "generator": {
                "block": {
                    "name": "biomesoplenty:gem_ore",
                    "metadata": 0
                },
                "material": "minecraft:end_stone",
                "cluster-size": 2
            },
            "cluster-count": 13,
            "min-height": 10,
            "max-height": 118,
            "retrogen": false,
            "biome": {
                "restriction": "whitelist",
                "value": [
                    {
                        "type": "dictionary",
                        "entry": "END"
                    }
                ]
            },
            "dimension": "all"
        }
    }
}
