<svg width="8" height="8" viewBox="0 0 8 8" fill="none" xmlns="http://www.w3.org/2000/svg">
<path d="M4.1875 1.75L6.4375 4L4.1875 6.25M6.125 4H1.5625" stroke="#636b34" stroke-linecap="round" stroke-linejoin="round"/>
</svg>
