C:\Users\mariarousi\eclipse-workspace\TwitterMapping\src\main\java\com\application\TwitterMapping\BabelfyText.java
C:\Users\mariarousi\eclipse-workspace\TwitterMapping\src\main\java\com\application\TwitterMapping\Server.java
C:\Users\mariarousi\eclipse-workspace\TwitterMapping\src\main\java\com\application\TwitterMapping\BabelfyInfo.java
C:\Users\mariarousi\eclipse-workspace\TwitterMapping\src\main\java\com\application\TwitterMapping\Mapping.java
C:\Users\mariarousi\eclipse-workspace\TwitterMapping\src\main\java\com\application\TwitterMapping\MyResource.java
C:\Users\mariarousi\eclipse-workspace\TwitterMapping\src\main\java\com\application\TwitterMapping\Namespaces.java
C:\Users\mariarousi\eclipse-workspace\TwitterMapping\src\main\java\com\application\TwitterMapping\Location.java
C:\Users\mariarousi\eclipse-workspace\TwitterMapping\src\main\java\com\application\TwitterMapping\RetrieveHypernym.java
