{
  "name": "loop",
  "preset": "ts-jest",
  "verbose": true,
  "testEnvironment": "node",
  "moduleNameMapper": {
    "^~/(.*)$": "<rootDir>/src/$1"
  },
  "moduleFileExtensions": ["ts", "js"],
  "globals": {
    "CONFIG": {
      "Loop": {
        "name": "Test Loop"
      },
      "MemorialCare": {
        "discountPricesUrl": "test_url"
      }
    }
  },
  "collectCoverageFrom": ["<rootDir>/src/**"],
  "coveragePathIgnorePatterns": ["<rootDir>/src/templates/", "<rootDir>/tests"],
  "testPathIgnorePatterns": ["dist/"],
  "reporters": [
    "default",
    [
      "./node_modules/jest-html-reporter",
      {
        "pageTitle": "Test Report",
        "outputPath": "./additional-artifacts/test-report.html"
      }
    ],
    [
      "./node_modules/jest-junit",
      {
        "outputDirectory": "./additional-artifacts/",
        "outputName": "test-report.xml"
      }
    ]
  ],
  "coverageReporters": [
    "text",
    "cobertura",
    "html"
  ],
  "coverageDirectory": "additional-artifacts"
}
