{
    "flow": [
        {
            "create_in_hive": {
                "sql_1": "CREATE TABLE IF NOT EXISTS mf_bigdata_scoring.mftv_lal_score (        actual_date string,        sk_subs_id bigint,        score_lal double,        snap_date string )"
            },
            "processing": {
                "columns": "revenue_inet_ext_bndl_s4,revenue_inet_ext_bndl_s8,revenue_inet_ext_bndl_s12",
                "input_custom_prepare_vector": "na",
                "input_fill_na": "1",
                "input_missing_na_value": "-1000000000",
                "model_missing_na_value": "-1000000000",
                "output_column_name": "score_lal",
                "output_index": "0",
                "output_scalar": "0"
            },
            "read_from_hive": {
                "sql_1": "SELECT filial_id, sk_subs_id, revenue_inet_ext_bndl_s4,revenue_inet_ext_bndl_s8,revenue_inet_ext_bndl_s12 FROM dm.a_udm_weekly;"
            },
            "validation": {
                "rule_instances": [
                    {
                        "instance_parameters": {
                            "dateCol": "date_key",
                            "diffError": 0.03,
                            "diffWarn": 0.05,
                            "numberOfPeriods": 12,
                            "operation": ">=",
                            "period": "MONTHS",
                            "shareError": 0.03,
                            "shareWarn": 0.05,
                            "table": "",
                            "value": 70,
                            "valueCol": "pcm_sms"
                        },
                        "rule_template_name": "ShareAndDiffAbsDifferenceFromAvg"
                    },
                    {
                        "instance_parameters": {
                            "dateCol": "date_col",
                            "lower": -0.05,
                            "operation": ">=",
                            "period": "MONTHS",
                            "table": "",
                            "upper": 0.05,
                            "value": 70,
                            "valueCol": "pct_tcm"
                        },
                        "rule_template_name": "CountWhereExpressionRelativeDifference"
                    }
                ]
            },
            "write_to_hive": {
                "sql_1": "INSERT OVERWRITE TABLE mf_bigdata_scoring.mftv_lal_score  PARTITION (SNAP_DATE = '$outer_start_prev_week')  SELECT CURRENT_DATE() AS actual_date        , sk_subs_id        , score_lal FROM temp;"
            }
        }
    ],
    "metadata": {
        "algorithm": {
            "type": "xgbregressor",
            "version": "0.9"
        },
        "entity_name": "91_vlatest_prod",
        "entity_shared_id": "91_vlatest_prod",
        "entity_version": "1.0.0",
        "project_name": "91_vlatest_prod",
        "project_shared_id": "91_vlatest_prod",
        "project_version": "1.0.0"
    }
}