{
    "flow": [
        {
            "create_in_hive": {
                "sql_1": "CREATE TABLE IF NOT EXISTS кепке (        actual_date string,        кепкеп,        укаука double,        snap_date string )"
            },
            "export_to_sumk": {
                "input_table": "кепкеп",
                "mapping": {
                    "filial_id": "кпкеп",
                    "prob": "кепкпе",
                    "snap_date": "кепкеп"
                },
                "where_clause": "кепкеп"
            },
            "processing": {
                "columns": "кеппек",
                "input_custom_prepare_vector": "аукпе",
                "input_fill_na": "0",
                "input_missing_na_value": "22",
                "model_missing_na_value": "аукпе",
                "output_column_name": "укаука",
                "output_index": "3",
                "output_scalar": "1"
            },
            "read_from_hive": {
                "sql_1": "SELECT пкепкп, кеппек FROM пкпкеп;"
            },
            "validation": {
                "rule_instances": []
            },
            "write_to_hive": {
                "sql_1": "INSERT OVERWRITE TABLE кепке  PARTITION (SNAP_DATE = '$outer_start_prev_week')  SELECT CURRENT_DATE() AS actual_date        , кепкеп        , укаука FROM temp;"
            },
            "write_to_oracle": {
                "sql_1": "CREATE TABLE IF NOT EXISTS кепке   (     ACTUAL_DATE DATE NOT NULL     , MSISDN STRING NOT NULL     , SK_SUBS_ID NUMBER(*, 0) NOT NULL     , BULLING_FILIAL_ID NUMBER NOT NULL     , PKU_DEFAULT_NEW_PROB NUMBER NOT NULL     , PCT NUMBER NOT NULL     , SNAP_DATE DATE NOT NULL     , FILIAL_ID NUMBER NOT NULL     )  PARTITION BY RANGE (SNAP_DATE) INTERVAL NUMTODSINTERVAL(1, 'DAY'))  (     PARTITION PO VALUES LESS THEN(TO_DATE('20/11/2020', 'YYYY-MM-DD'))     )      COMPRESS PCTFREE 0;  ALTER TABLE кепке DROP PARTITION FOR (TO_DATE('$OUTER_START_PREV_WEEK', 'YYYY-MM-DD'));"
            }
        }
    ],
    "metadata": {
        "algorithm": {
            "type": "xgbregressor",
            "version": "0.9"
        },
        "entity_name": "68_vlatest_prod",
        "entity_shared_id": "68_vlatest_prod",
        "entity_version": "1.0.0",
        "project_name": "68_vlatest_prod",
        "project_shared_id": "68_vlatest_prod",
        "project_version": "1.0.0"
    }
}