﻿{
  "PackageData": [
    {
      "Row": [
        {
          "SchemaColumnUId": "ae0e45ca-c495-4fe7-a39d-3ab7278e1617",
          "Value": "36a8fc55-47bb-4f67-ab3a-192405525408"
        },
        {
          "SchemaColumnUId": "fa51db91-37a6-4df4-bbcd-8481740c5d8c",
          "Value": "dc3a1d68-f1ba-472a-9e7d-7ac012df623d",
          "DisplayValue": "null"
        },
        {
          "SchemaColumnUId": "beb7f6b2-f338-45ac-80a8-7177238b52a9",
          "Value": "null"
        },
        {
          "SchemaColumnUId": "42ed2383-1455-49ec-82df-1a184c12a398",
          "Value": "[{\"columnUId\":null}]"
        },
        {
          "SchemaColumnUId": "2bf9d686-2f7e-464b-a049-041c3225dc51",
          "Value": "null"
        }
      ]
    }
  ]
}