﻿{
  "Descriptor": {
    "UId": "e60271be-62f2-4c56-ace1-22f49491a94d",
    "Name": "UsrConcertProgram",
    "ModifiedOnUtc": "\/Date(1602485004000)\/",
    "InstallType": 0,
    "Schema": {
      "UId": "d9338298-977d-487f-8a34-b0e425b6e6e5",
      "Name": "UsrConcertProgram"
    },
    "Columns": [
      {
        "ColumnUId": "ae0e45ca-c495-4fe7-a39d-3ab7278e1617",
        "IsForceUpdate": false,
        "IsKey": true,
        "ColumnName": "Id",
        "DataTypeValueUId": "23018567-a13c-4320-8687-fd6f9e3699bd"
      },
      {
        "ColumnUId": "9efcfa5d-6097-4af2-9c45-8cb33c8872b1",
        "IsForceUpdate": false,
        "IsKey": false,
        "ColumnName": "UsrLookup1",
        "DataTypeValueUId": "b295071f-7ea9-4e62-8d1a-919bf3732ff2"
      },
      {
        "ColumnUId": "ece59c6c-45d0-491e-80bf-ffd325288637",
        "IsForceUpdate": false,
        "IsKey": false,
        "ColumnName": "UsrString3",
        "DataTypeValueUId": "ddb3a1ee-07e8-4d62-b7a9-d0e618b00fbd"
      },
      {
        "ColumnUId": "3b8e86d3-fe94-4f85-a8e7-6446fc0b0838",
        "IsForceUpdate": false,
        "IsKey": false,
        "ColumnName": "UsrInteger1",
        "DataTypeValueUId": "6b6b74e2-820d-490e-a017-2b73d4ccf2b0"
      },
      {
        "ColumnUId": "482ecad9-3a38-4ca1-831b-462462a51acd",
        "IsForceUpdate": false,
        "IsKey": false,
        "ColumnName": "UsrNotes",
        "DataTypeValueUId": "c0f04627-4620-4bc0-84e5-9419dc8516b1"
      },
      {
        "ColumnUId": "ab08b230-f5db-4044-8dba-7607c55fc62c",
        "IsForceUpdate": false,
        "IsKey": false,
        "ColumnName": "UsrString2",
        "DataTypeValueUId": "ddb3a1ee-07e8-4d62-b7a9-d0e618b00fbd"
      },
      {
        "ColumnUId": "13f2f25d-e0f7-4565-8d0b-f931c4053bae",
        "IsForceUpdate": false,
        "IsKey": false,
        "ColumnName": "UsrBoolean1",
        "DataTypeValueUId": "90b65bf8-0ffc-4141-8779-2420877af907"
      },
      {
        "ColumnUId": "a6d51f21-06d9-4350-93b6-5b856d80f145",
        "IsForceUpdate": false,
        "IsKey": false,
        "ColumnName": "UsrString1",
        "DataTypeValueUId": "ddb3a1ee-07e8-4d62-b7a9-d0e618b00fbd"
      },
      {
        "ColumnUId": "6042eb67-e1da-45f2-9bed-e9cf3a52e8f9",
        "IsForceUpdate": false,
        "IsKey": false,
        "ColumnName": "UsrName",
        "DataTypeValueUId": "ddb3a1ee-07e8-4d62-b7a9-d0e618b00fbd"
      },
      {
        "ColumnUId": "cb5b16fb-e67b-45a4-99c8-4fd6f9646959",
        "IsForceUpdate": false,
        "IsKey": false,
        "ColumnName": "UsrLookup2",
        "DataTypeValueUId": "b295071f-7ea9-4e62-8d1a-919bf3732ff2"
      }
    ]
  }
}