﻿{
  "Descriptor": {
    "UId": "eaa4f513-c245-40d5-9dca-ce3cad4c1ca9",
    "Name": "UsrUsrPerfomance53b3a2cbPage",
    "ModifiedOnUtc": "\/Date(1602093710000)\/",
    "Parent": {
      "UId": "d3cc497c-f286-4f13-99c1-751c468733c0",
      "Name": "BasePageV2"
    },
    "ManagerName": "ClientUnitSchemaManager",
    "Caption": "Карточка схемы: \"Выступления\"",
    "DependsOn": []
  }
}