<?xml version="1.0" encoding="UTF-8" standalone="no"?>
<!-- Created with Inkscape (http://www.inkscape.org/) -->

<svg
   xmlns:dc="http://purl.org/dc/elements/1.1/"
   xmlns:cc="http://creativecommons.org/ns#"
   xmlns:rdf="http://www.w3.org/1999/02/22-rdf-syntax-ns#"
   xmlns:svg="http://www.w3.org/2000/svg"
   xmlns="http://www.w3.org/2000/svg"
   xmlns:sodipodi="http://sodipodi.sourceforge.net/DTD/sodipodi-0.dtd"
   xmlns:inkscape="http://www.inkscape.org/namespaces/inkscape"
   width="210mm"
   height="297mm"
   viewBox="0 0 210 297"
   version="1.1"
   id="svg2379"
   inkscape:version="0.92.5 (2060ec1f9f, 2020-04-08)"
   sodipodi:docname="arrays.svg">
  <defs
     id="defs2373">
    <marker
       inkscape:stockid="Arrow1Lstart"
       orient="auto"
       refY="0"
       refX="0"
       id="marker2205"
       style="overflow:visible"
       inkscape:isstock="true">
      <path
         inkscape:connector-curvature="0"
         id="path2203"
         d="M 0,0 5,-5 -12.5,0 5,5 Z"
         style="fill:#000000;fill-opacity:1;fill-rule:evenodd;stroke:#000000;stroke-width:1.00000003pt;stroke-opacity:1"
         transform="matrix(0.8,0,0,0.8,10,0)" />
    </marker>
    <marker
       inkscape:stockid="Arrow1Lend"
       orient="auto"
       refY="0"
       refX="0"
       id="marker2208"
       style="overflow:visible"
       inkscape:isstock="true">
      <path
         inkscape:connector-curvature="0"
         id="path1942"
         d="M 0,0 5,-5 -12.5,0 5,5 Z"
         style="fill:#000000;fill-opacity:1;fill-rule:evenodd;stroke:#000000;stroke-width:1.00000003pt;stroke-opacity:1"
         transform="matrix(-0.8,0,0,-0.8,-10,0)" />
    </marker>
    <marker
       inkscape:stockid="Arrow1Lstart"
       orient="auto"
       refY="0"
       refX="0"
       id="marker2205-2"
       style="overflow:visible"
       inkscape:isstock="true">
      <path
         inkscape:connector-curvature="0"
         id="path2203-9"
         d="M 0,0 5,-5 -12.5,0 5,5 Z"
         style="fill:#000000;fill-opacity:1;fill-rule:evenodd;stroke:#000000;stroke-width:1.00000003pt;stroke-opacity:1"
         transform="matrix(0.8,0,0,0.8,10,0)" />
    </marker>
    <marker
       inkscape:stockid="Arrow1Lend"
       orient="auto"
       refY="0"
       refX="0"
       id="marker2208-3"
       style="overflow:visible"
       inkscape:isstock="true">
      <path
         inkscape:connector-curvature="0"
         id="path1942-1"
         d="M 0,0 5,-5 -12.5,0 5,5 Z"
         style="fill:#000000;fill-opacity:1;fill-rule:evenodd;stroke:#000000;stroke-width:1.00000003pt;stroke-opacity:1"
         transform="matrix(-0.8,0,0,-0.8,-10,0)" />
    </marker>
    <marker
       inkscape:stockid="Arrow1Lstart"
       orient="auto"
       refY="0"
       refX="0"
       id="marker2205-2-5"
       style="overflow:visible"
       inkscape:isstock="true">
      <path
         inkscape:connector-curvature="0"
         id="path2203-9-9"
         d="M 0,0 5,-5 -12.5,0 5,5 Z"
         style="fill:#000000;fill-opacity:1;fill-rule:evenodd;stroke:#000000;stroke-width:1.00000003pt;stroke-opacity:1"
         transform="matrix(0.8,0,0,0.8,10,0)" />
    </marker>
    <marker
       inkscape:stockid="Arrow1Lend"
       orient="auto"
       refY="0"
       refX="0"
       id="marker2208-3-4"
       style="overflow:visible"
       inkscape:isstock="true">
      <path
         inkscape:connector-curvature="0"
         id="path1942-1-9"
         d="M 0,0 5,-5 -12.5,0 5,5 Z"
         style="fill:#000000;fill-opacity:1;fill-rule:evenodd;stroke:#000000;stroke-width:1.00000003pt;stroke-opacity:1"
         transform="matrix(-0.8,0,0,-0.8,-10,0)" />
    </marker>
    <marker
       inkscape:stockid="Arrow1Lstart"
       orient="auto"
       refY="0"
       refX="0"
       id="marker2205-2-7"
       style="overflow:visible"
       inkscape:isstock="true">
      <path
         inkscape:connector-curvature="0"
         id="path2203-9-4"
         d="M 0,0 5,-5 -12.5,0 5,5 Z"
         style="fill:#000000;fill-opacity:1;fill-rule:evenodd;stroke:#000000;stroke-width:1.00000003pt;stroke-opacity:1"
         transform="matrix(0.8,0,0,0.8,10,0)" />
    </marker>
    <marker
       inkscape:stockid="Arrow1Lend"
       orient="auto"
       refY="0"
       refX="0"
       id="marker2208-3-1"
       style="overflow:visible"
       inkscape:isstock="true">
      <path
         inkscape:connector-curvature="0"
         id="path1942-1-8"
         d="M 0,0 5,-5 -12.5,0 5,5 Z"
         style="fill:#000000;fill-opacity:1;fill-rule:evenodd;stroke:#000000;stroke-width:1.00000003pt;stroke-opacity:1"
         transform="matrix(-0.8,0,0,-0.8,-10,0)" />
    </marker>
  </defs>
  <sodipodi:namedview
     id="base"
     pagecolor="#ffffff"
     bordercolor="#666666"
     borderopacity="1.0"
     inkscape:pageopacity="0.0"
     inkscape:pageshadow="2"
     inkscape:zoom="0.7"
     inkscape:cx="-936.95993"
     inkscape:cy="1274.7069"
     inkscape:document-units="mm"
     inkscape:current-layer="layer1"
     showgrid="false"
     inkscape:window-width="1920"
     inkscape:window-height="1016"
     inkscape:window-x="0"
     inkscape:window-y="27"
     inkscape:window-maximized="1" />
  <metadata
     id="metadata2376">
    <rdf:RDF>
      <cc:Work
         rdf:about="">
        <dc:format>image/svg+xml</dc:format>
        <dc:type
           rdf:resource="http://purl.org/dc/dcmitype/StillImage" />
        <dc:title></dc:title>
      </cc:Work>
    </rdf:RDF>
  </metadata>
  <g
     inkscape:label="Layer 1"
     inkscape:groupmode="layer"
     id="layer1">
    <rect
       style="fill:none;fill-opacity:0.52631597;stroke:#000000;stroke-width:0.75;stroke-linejoin:bevel;stroke-miterlimit:4;stroke-dasharray:none;stroke-dashoffset:0;stroke-opacity:1"
       id="rect100898-6-4"
       width="28.901974"
       height="18.57984"
       x="-223.4791"
       y="-105.92347"
       ry="0.35438293"
       inkscape:export-filename="/home/i-tera/Daniel/cosas_personales/informaticai_iua_undef/topics/arrays1d/tex/img/exported/arrays.png"
       inkscape:export-xdpi="95.900002"
       inkscape:export-ydpi="95.900002" />
    <rect
       style="fill:none;fill-opacity:0.52631597;stroke:#000000;stroke-width:0.75;stroke-linejoin:bevel;stroke-miterlimit:4;stroke-dasharray:none;stroke-dashoffset:0;stroke-opacity:1"
       id="rect100898-3-0-8"
       width="28.901974"
       height="18.57984"
       x="-194.57718"
       y="-105.92347"
       ry="0.35438293"
       inkscape:export-filename="/home/i-tera/Daniel/cosas_personales/informaticai_iua_undef/topics/arrays1d/tex/img/exported/arrays.png"
       inkscape:export-xdpi="95.900002"
       inkscape:export-ydpi="95.900002" />
    <rect
       style="fill:none;fill-opacity:0.52631597;stroke:#000000;stroke-width:0.75;stroke-linejoin:bevel;stroke-miterlimit:4;stroke-dasharray:none;stroke-dashoffset:0;stroke-opacity:1"
       id="rect100898-7-8-9"
       width="28.901974"
       height="18.57984"
       x="-165.6752"
       y="-105.92347"
       ry="0.35438293"
       inkscape:export-filename="/home/i-tera/Daniel/cosas_personales/informaticai_iua_undef/topics/arrays1d/tex/img/exported/arrays.png"
       inkscape:export-xdpi="95.900002"
       inkscape:export-ydpi="95.900002" />
    <rect
       style="fill:none;fill-opacity:0.52631597;stroke:#000000;stroke-width:0.75;stroke-linejoin:bevel;stroke-miterlimit:4;stroke-dasharray:none;stroke-dashoffset:0;stroke-opacity:1"
       id="rect100898-2-3-9"
       width="28.901974"
       height="18.57984"
       x="-136.77322"
       y="-105.92347"
       ry="0.35438293"
       inkscape:export-filename="/home/i-tera/Daniel/cosas_personales/informaticai_iua_undef/topics/arrays1d/tex/img/exported/arrays.png"
       inkscape:export-xdpi="95.900002"
       inkscape:export-ydpi="95.900002" />
    <rect
       style="fill:none;fill-opacity:0.52631597;stroke:#000000;stroke-width:0.75;stroke-linejoin:bevel;stroke-miterlimit:4;stroke-dasharray:none;stroke-dashoffset:0;stroke-opacity:1"
       id="rect100898-2-3-9-1"
       width="28.901974"
       height="18.57984"
       x="-107.87125"
       y="-105.92347"
       ry="0.35438293"
       inkscape:export-filename="/home/i-tera/Daniel/cosas_personales/informaticai_iua_undef/topics/arrays1d/tex/img/exported/arrays.png"
       inkscape:export-xdpi="95.900002"
       inkscape:export-ydpi="95.900002" />
    <text
       xml:space="preserve"
       style="font-style:normal;font-weight:normal;font-size:4.86204004px;line-height:1.25;font-family:sans-serif;text-align:center;text-anchor:middle;fill:#000000;fill-opacity:1;stroke:none;stroke-width:0.12155157"
       x="-212.27872"
       y="-96.640213"
       id="text9784-9-1-8-1-8-34-4-9-8-5-3"
       transform="scale(0.98579704,1.0144076)"
       inkscape:export-filename="/home/i-tera/Daniel/cosas_personales/informaticai_iua_undef/topics/arrays1d/tex/img/exported/arrays.png"
       inkscape:export-xdpi="95.900002"
       inkscape:export-ydpi="95.900002"><tspan
         sodipodi:role="line"
         id="tspan9782-2-3-8-0-6-30-7-3-1-3-6"
         style="font-style:normal;font-variant:normal;font-weight:normal;font-stretch:normal;font-family:'Times New Roman';-inkscape-font-specification:'Times New Roman, ';text-align:center;text-anchor:middle;stroke-width:0.12155157"
         x="-212.27872"
         y="-96.640213">Número</tspan><tspan
         sodipodi:role="line"
         style="font-style:normal;font-variant:normal;font-weight:normal;font-stretch:normal;font-family:'Times New Roman';-inkscape-font-specification:'Times New Roman, ';text-align:center;text-anchor:middle;stroke-width:0.12155157"
         x="-212.27872"
         y="-90.548782"
         id="tspan1835">float</tspan></text>
    <text
       xml:space="preserve"
       style="font-style:normal;font-weight:normal;font-size:4.86204004px;line-height:1.25;font-family:sans-serif;text-align:center;text-anchor:middle;fill:#000000;fill-opacity:1;stroke:none;stroke-width:0.12155158"
       x="-183.4252"
       y="-96.640213"
       id="text9784-9-1-8-1-8-34-4-9-8-5-3-7"
       transform="scale(0.98579704,1.0144076)"
       inkscape:export-filename="/home/i-tera/Daniel/cosas_personales/informaticai_iua_undef/topics/arrays1d/tex/img/exported/arrays.png"
       inkscape:export-xdpi="95.900002"
       inkscape:export-ydpi="95.900002"><tspan
         sodipodi:role="line"
         id="tspan9782-2-3-8-0-6-30-7-3-1-3-6-5"
         style="font-style:normal;font-variant:normal;font-weight:normal;font-stretch:normal;font-family:'Times New Roman';-inkscape-font-specification:'Times New Roman, ';text-align:center;text-anchor:middle;stroke-width:0.12155158"
         x="-183.4252"
         y="-96.640213">Número</tspan><tspan
         sodipodi:role="line"
         style="font-style:normal;font-variant:normal;font-weight:normal;font-stretch:normal;font-family:'Times New Roman';-inkscape-font-specification:'Times New Roman, ';text-align:center;text-anchor:middle;stroke-width:0.12155158"
         x="-183.4252"
         y="-90.548782"
         id="tspan1835-3">float</tspan></text>
    <text
       xml:space="preserve"
       style="font-style:normal;font-weight:normal;font-size:4.86204004px;line-height:1.25;font-family:sans-serif;text-align:center;text-anchor:middle;fill:#000000;fill-opacity:1;stroke:none;stroke-width:0.12155159"
       x="-154.57169"
       y="-96.640213"
       id="text9784-9-1-8-1-8-34-4-9-8-5-3-7-5"
       transform="scale(0.98579704,1.0144076)"
       inkscape:export-filename="/home/i-tera/Daniel/cosas_personales/informaticai_iua_undef/topics/arrays1d/tex/img/exported/arrays.png"
       inkscape:export-xdpi="95.900002"
       inkscape:export-ydpi="95.900002"><tspan
         sodipodi:role="line"
         id="tspan9782-2-3-8-0-6-30-7-3-1-3-6-5-6"
         style="font-style:normal;font-variant:normal;font-weight:normal;font-stretch:normal;font-family:'Times New Roman';-inkscape-font-specification:'Times New Roman, ';text-align:center;text-anchor:middle;stroke-width:0.12155159"
         x="-154.57169"
         y="-96.640213">Número</tspan><tspan
         sodipodi:role="line"
         style="font-style:normal;font-variant:normal;font-weight:normal;font-stretch:normal;font-family:'Times New Roman';-inkscape-font-specification:'Times New Roman, ';text-align:center;text-anchor:middle;stroke-width:0.12155159"
         x="-154.57169"
         y="-90.548782"
         id="tspan1835-3-2">float</tspan></text>
    <text
       xml:space="preserve"
       style="font-style:normal;font-weight:normal;font-size:4.86204004px;line-height:1.25;font-family:sans-serif;text-align:center;text-anchor:middle;fill:#000000;fill-opacity:1;stroke:none;stroke-width:0.12155159"
       x="-125.71822"
       y="-96.640213"
       id="text9784-9-1-8-1-8-34-4-9-8-5-3-7-9"
       transform="scale(0.98579704,1.0144076)"
       inkscape:export-filename="/home/i-tera/Daniel/cosas_personales/informaticai_iua_undef/topics/arrays1d/tex/img/exported/arrays.png"
       inkscape:export-xdpi="95.900002"
       inkscape:export-ydpi="95.900002"><tspan
         sodipodi:role="line"
         id="tspan9782-2-3-8-0-6-30-7-3-1-3-6-5-1"
         style="font-style:normal;font-variant:normal;font-weight:normal;font-stretch:normal;font-family:'Times New Roman';-inkscape-font-specification:'Times New Roman, ';text-align:center;text-anchor:middle;stroke-width:0.12155159"
         x="-125.71822"
         y="-96.640213">Número</tspan><tspan
         sodipodi:role="line"
         style="font-style:normal;font-variant:normal;font-weight:normal;font-stretch:normal;font-family:'Times New Roman';-inkscape-font-specification:'Times New Roman, ';text-align:center;text-anchor:middle;stroke-width:0.12155159"
         x="-125.71822"
         y="-90.548782"
         id="tspan1835-3-27">float</tspan></text>
    <text
       xml:space="preserve"
       style="font-style:normal;font-weight:normal;font-size:4.86204004px;line-height:1.25;font-family:sans-serif;text-align:center;text-anchor:middle;fill:#000000;fill-opacity:1;stroke:none;stroke-width:0.12155159"
       x="-96.864769"
       y="-96.640213"
       id="text9784-9-1-8-1-8-34-4-9-8-5-3-7-0"
       transform="scale(0.98579704,1.0144076)"
       inkscape:export-filename="/home/i-tera/Daniel/cosas_personales/informaticai_iua_undef/topics/arrays1d/tex/img/exported/arrays.png"
       inkscape:export-xdpi="95.900002"
       inkscape:export-ydpi="95.900002"><tspan
         sodipodi:role="line"
         id="tspan9782-2-3-8-0-6-30-7-3-1-3-6-5-9"
         style="font-style:normal;font-variant:normal;font-weight:normal;font-stretch:normal;font-family:'Times New Roman';-inkscape-font-specification:'Times New Roman, ';text-align:center;text-anchor:middle;stroke-width:0.12155159"
         x="-96.864769"
         y="-96.640213">Número</tspan><tspan
         sodipodi:role="line"
         style="font-style:normal;font-variant:normal;font-weight:normal;font-stretch:normal;font-family:'Times New Roman';-inkscape-font-specification:'Times New Roman, ';text-align:center;text-anchor:middle;stroke-width:0.12155159"
         x="-96.864769"
         y="-90.548782"
         id="tspan1835-3-3">float</tspan></text>
    <path
       style="fill:none;stroke:#000000;stroke-width:0.26458332px;stroke-linecap:butt;stroke-linejoin:miter;stroke-opacity:1"
       d="m -223.63478,-107.51098 v -8.2577"
       id="path1920"
       inkscape:connector-curvature="0"
       inkscape:export-filename="/home/i-tera/Daniel/cosas_personales/informaticai_iua_undef/topics/arrays1d/tex/img/exported/arrays.png"
       inkscape:export-xdpi="95.900002"
       inkscape:export-ydpi="95.900002" />
    <path
       style="fill:none;stroke:#000000;stroke-width:0.26458332px;stroke-linecap:butt;stroke-linejoin:miter;stroke-opacity:1"
       d="m -50.394271,-107.51098 v -8.2577"
       id="path1920-6"
       inkscape:connector-curvature="0"
       inkscape:export-filename="/home/i-tera/Daniel/cosas_personales/informaticai_iua_undef/topics/arrays1d/tex/img/exported/arrays.png"
       inkscape:export-xdpi="95.900002"
       inkscape:export-ydpi="95.900002" />
    <path
       style="fill:none;stroke:#000000;stroke-width:0.28873453;stroke-linecap:butt;stroke-linejoin:miter;stroke-miterlimit:4;stroke-dasharray:none;stroke-opacity:1;marker-start:url(#marker2205);marker-end:url(#marker2208)"
       d="M -223.6672,-111.63388 H -51.760252"
       id="path1937"
       inkscape:connector-curvature="0"
       inkscape:export-filename="/home/i-tera/Daniel/cosas_personales/informaticai_iua_undef/topics/arrays1d/tex/img/exported/arrays.png"
       inkscape:export-xdpi="95.900002"
       inkscape:export-ydpi="95.900002" />
    <text
       xml:space="preserve"
       style="font-style:normal;font-weight:normal;font-size:4.86204004px;line-height:1.25;font-family:sans-serif;text-align:center;text-anchor:middle;fill:#000000;fill-opacity:1;stroke:none;stroke-width:0.12155158"
       x="-139.70734"
       y="-112.22746"
       id="text9784-9-1-8-1-8-34-4-9-8-5-3-2"
       transform="scale(0.98579704,1.0144076)"
       inkscape:export-filename="/home/i-tera/Daniel/cosas_personales/informaticai_iua_undef/topics/arrays1d/tex/img/exported/arrays.png"
       inkscape:export-xdpi="95.900002"
       inkscape:export-ydpi="95.900002"><tspan
         sodipodi:role="line"
         style="font-style:normal;font-variant:normal;font-weight:normal;font-stretch:normal;font-family:'Times New Roman';-inkscape-font-specification:'Times New Roman, ';text-align:center;text-anchor:middle;stroke-width:0.12155158"
         x="-139.70734"
         y="-112.22746"
         id="tspan1835-9">Almacenamieneto suficiente para seis números float</tspan></text>
    <text
       xml:space="preserve"
       style="font-style:normal;font-weight:normal;font-size:4.86204004px;line-height:1.25;font-family:sans-serif;text-align:center;text-anchor:middle;fill:#000000;fill-opacity:1;stroke:none;stroke-width:0.12155158"
       x="-241.73672"
       y="-94.715637"
       id="text9784-9-1-8-1-8-34-4-9-8-5-3-73"
       transform="scale(0.98579704,1.0144076)"
       inkscape:export-filename="/home/i-tera/Daniel/cosas_personales/informaticai_iua_undef/topics/arrays1d/tex/img/exported/arrays.png"
       inkscape:export-xdpi="95.900002"
       inkscape:export-ydpi="95.900002"><tspan
         sodipodi:role="line"
         style="font-style:normal;font-variant:normal;font-weight:normal;font-stretch:normal;font-family:'Times New Roman';-inkscape-font-specification:'Times New Roman, ';text-align:center;text-anchor:middle;stroke-width:0.12155158"
         x="-241.73672"
         y="-94.715637"
         id="tspan2331">float temp[6]</tspan></text>
    <rect
       style="fill:none;fill-opacity:0.52631597;stroke:#000000;stroke-width:0.75;stroke-linejoin:bevel;stroke-miterlimit:4;stroke-dasharray:none;stroke-dashoffset:0;stroke-opacity:1"
       id="rect100898-2-3-9-1-44"
       width="28.901974"
       height="18.57984"
       x="-78.969269"
       y="-105.92347"
       ry="0.35438293"
       inkscape:export-filename="/home/i-tera/Daniel/cosas_personales/informaticai_iua_undef/topics/arrays1d/tex/img/exported/arrays.png"
       inkscape:export-xdpi="95.900002"
       inkscape:export-ydpi="95.900002" />
    <text
       xml:space="preserve"
       style="font-style:normal;font-weight:normal;font-size:4.86204004px;line-height:1.25;font-family:sans-serif;text-align:center;text-anchor:middle;fill:#000000;fill-opacity:1;stroke:none;stroke-width:0.12155159"
       x="-67.546387"
       y="-96.640213"
       id="text9784-9-1-8-1-8-34-4-9-8-5-3-7-0-7"
       transform="scale(0.98579704,1.0144076)"
       inkscape:export-filename="/home/i-tera/Daniel/cosas_personales/informaticai_iua_undef/topics/arrays1d/tex/img/exported/arrays.png"
       inkscape:export-xdpi="95.900002"
       inkscape:export-ydpi="95.900002"><tspan
         sodipodi:role="line"
         id="tspan9782-2-3-8-0-6-30-7-3-1-3-6-5-9-6"
         style="font-style:normal;font-variant:normal;font-weight:normal;font-stretch:normal;font-family:'Times New Roman';-inkscape-font-specification:'Times New Roman, ';text-align:center;text-anchor:middle;stroke-width:0.12155159"
         x="-67.546387"
         y="-96.640213">Número</tspan><tspan
         sodipodi:role="line"
         style="font-style:normal;font-variant:normal;font-weight:normal;font-stretch:normal;font-family:'Times New Roman';-inkscape-font-specification:'Times New Roman, ';text-align:center;text-anchor:middle;stroke-width:0.12155159"
         x="-67.546387"
         y="-90.548782"
         id="tspan1835-3-3-3">float</tspan></text>
  </g>
</svg>
