<mxfile host="app.diagrams.net" modified="2021-04-05T06:25:07.785Z" agent="5.0 (iPad; CPU OS 12_5 like Mac OS X) AppleWebKit/605.1.15 (KHTML, like Gecko) CriOS/87.0.4280.77 Mobile/15E148 Safari/604.1" etag="fd1VHCfcJvx2TM5pr92o" version="14.5.7" type="gitlab">
  <diagram id="bbuCRffd3UhP7mXOHkNW" name="Page-1">
    <mxGraphModel dx="734" dy="790" grid="1" gridSize="10" guides="1" tooltips="1" connect="1" arrows="1" fold="1" page="1" pageScale="1" pageWidth="850" pageHeight="1100" math="0" shadow="0">
      <root>
        <mxCell id="0" />
        <mxCell id="1" parent="0" />
        <mxCell id="VO8GOfykh_yB2EuM_mE1-1" value="Jurnal transaksi" style="rounded=1;whiteSpace=wrap;html=1;" parent="1" vertex="1">
          <mxGeometry x="240" y="100" width="120" height="60" as="geometry" />
        </mxCell>
        <mxCell id="VO8GOfykh_yB2EuM_mE1-2" value="Jurnal pinjaman" style="rounded=1;whiteSpace=wrap;html=1;" parent="1" vertex="1">
          <mxGeometry x="240" y="280" width="120" height="60" as="geometry" />
        </mxCell>
        <mxCell id="VO8GOfykh_yB2EuM_mE1-3" value="&lt;h1&gt;Jurnal umum&lt;/h1&gt;&lt;p&gt;Semua unit Termasuk DBM&lt;/p&gt;" style="text;html=1;strokeColor=none;fillColor=none;spacing=5;spacingTop=-20;whiteSpace=wrap;overflow=hidden;rounded=0;" parent="1" vertex="1">
          <mxGeometry x="30" y="130" width="190" height="120" as="geometry" />
        </mxCell>
        <mxCell id="VO8GOfykh_yB2EuM_mE1-4" value="&lt;h1&gt;Jurnal pinjaman&lt;/h1&gt;&lt;div&gt;hanya unit KUM UEP dan SPP&lt;/div&gt;" style="text;html=1;strokeColor=none;fillColor=none;spacing=5;spacingTop=-20;whiteSpace=wrap;overflow=hidden;rounded=0;" parent="1" vertex="1">
          <mxGeometry x="30" y="250" width="190" height="120" as="geometry" />
        </mxCell>
        <mxCell id="VO8GOfykh_yB2EuM_mE1-5" value="Melakukan konfigurasi transaksi sebelum melakukan input data transaksi" style="rounded=0;whiteSpace=wrap;html=1;" parent="1" vertex="1">
          <mxGeometry x="390" y="180" width="120" height="60" as="geometry" />
        </mxCell>
        <mxCell id="VO8GOfykh_yB2EuM_mE1-6" value="" style="endArrow=classic;html=1;entryX=0;entryY=0.5;entryDx=0;entryDy=0;exitX=0.5;exitY=1;exitDx=0;exitDy=0;" parent="1" source="VO8GOfykh_yB2EuM_mE1-1" target="VO8GOfykh_yB2EuM_mE1-5" edge="1">
          <mxGeometry width="50" height="50" relative="1" as="geometry">
            <mxPoint x="240" y="190" as="sourcePoint" />
            <mxPoint x="290" y="140" as="targetPoint" />
          </mxGeometry>
        </mxCell>
        <mxCell id="VO8GOfykh_yB2EuM_mE1-7" value="" style="endArrow=classic;html=1;entryX=0;entryY=0.5;entryDx=0;entryDy=0;exitX=0.5;exitY=0;exitDx=0;exitDy=0;" parent="1" source="VO8GOfykh_yB2EuM_mE1-2" target="VO8GOfykh_yB2EuM_mE1-5" edge="1">
          <mxGeometry width="50" height="50" relative="1" as="geometry">
            <mxPoint x="210" y="340" as="sourcePoint" />
            <mxPoint x="330" y="410" as="targetPoint" />
          </mxGeometry>
        </mxCell>
        <mxCell id="VO8GOfykh_yB2EuM_mE1-8" value="Pencairan dan angsuran" style="rounded=1;whiteSpace=wrap;html=1;fillColor=#fff2cc;strokeColor=#d6b656;" parent="1" vertex="1">
          <mxGeometry x="400" y="280" width="120" height="60" as="geometry" />
        </mxCell>
        <mxCell id="VO8GOfykh_yB2EuM_mE1-9" value="Melakukan konfigurasi transaksi di awal (lebih ringkas daripada konfigurasi jurnal)" style="rounded=0;whiteSpace=wrap;html=1;" parent="1" vertex="1">
          <mxGeometry x="580" y="265" width="150" height="90" as="geometry" />
        </mxCell>
        <mxCell id="VO8GOfykh_yB2EuM_mE1-10" value="" style="endArrow=classic;html=1;entryX=0;entryY=0.5;entryDx=0;entryDy=0;" parent="1" source="VO8GOfykh_yB2EuM_mE1-2" target="VO8GOfykh_yB2EuM_mE1-8" edge="1">
          <mxGeometry width="50" height="50" relative="1" as="geometry">
            <mxPoint x="350" y="470" as="sourcePoint" />
            <mxPoint x="400" y="420" as="targetPoint" />
          </mxGeometry>
        </mxCell>
        <mxCell id="VO8GOfykh_yB2EuM_mE1-11" value="" style="endArrow=classic;html=1;entryX=0;entryY=0.5;entryDx=0;entryDy=0;exitX=1;exitY=0.5;exitDx=0;exitDy=0;" parent="1" source="VO8GOfykh_yB2EuM_mE1-8" target="VO8GOfykh_yB2EuM_mE1-9" edge="1">
          <mxGeometry width="50" height="50" relative="1" as="geometry">
            <mxPoint x="520" y="320" as="sourcePoint" />
            <mxPoint x="400" y="320" as="targetPoint" />
          </mxGeometry>
        </mxCell>
      </root>
    </mxGraphModel>
  </diagram>
</mxfile>
