0 : NOTSET
1 : NOTSET
2 : NOTSET
3 : NOTSET
4 : NOTSET
5 : NOTSET
6 : NOTSET
7 : NOTSET
8 : NOTSET
9 : NOTSET
10 : NOTSET
11 : NOTSET
12 : NOTSET
13 : NOTSET
14 : NOTSET
15 : NOTSET
16 : NOTSET
17 : NOTSET
18 : NOTSET
19 : NOTSET
20 : NOTSET
21 : NOTSET
22 : NOTSET
23 : NOTSET
24 : NOTSET
25 : NOTSET
26 : NOTSET
27 : NOTSET
28 : NOTSET
29 : NOTSET
30 : NOTSET
31 : NOTSET
32 : NOTSET
33 : NOTSET
34 : NOTSET
35 : NOTSET
36 : NOTSET
37 : NOTSET
38 : NOTSET
39 : NOTSET
40 : NOTSET
41 : NOTSET
42 : NOTSET
43 : NOTSET
44 : NOTSET
45 : NOTSET
46 : NOTSET
47 : NOTSET
48 : NOTSET
49 : NOTSET
50 : NOTSET
51 : NOTSET
52 : NOTSET
53 : NOTSET
54 : NOTSET
55 : NOTSET
56 : NOTSET
57 : NOTSET
58 : NOTSET
59 : NOTSET
60 : NOTSET
61 : NOTSET
62 : NOTSET
63 : NOTSET
64 : NOTSET
65 : NOTSET
66 : NOTSET
67 : NOTSET
68 : NOTSET
69 : NOTSET
70 : NOTSET
71 : NOTSET
72 : NOTSET
73 : NOTSET
74 : NOTSET
75 : NOTSET
76 : NOTSET
77 : NOTSET
78 : NOTSET
79 : NOTSET
80 : NOTSET
81 : NOTSET
82 : NOTSET
83 : NOTSET
84 : NOTSET
85 : NOTSET
86 : NOTSET
87 : NOTSET
88 : NOTSET
89 : NOTSET
90 : NOTSET
91 : NOTSET
92 : NOTSET
93 : NOTSET
94 : NOTSET
95 : NOTSET
96 : SET
97 : SET
98 : SET
99 : SET
100 : SET
101 : SET
102 : SET
103 : SET
104 : SET
105 : SET
106 : SET
107 : SET
108 : SET
109 : SET
110 : SET
111 : SET
112 : SET
113 : SET
114 : SET
115 : SET
116 : SET
117 : SET
118 : SET
119 : SET
120 : SET
121 : SET
122 : SET
123 : SET
124 : SET
125 : SET
126 : SET
127 : SET
128 : SET
129 : SET
130 : SET
131 : SET
132 : SET
133 : SET
134 : SET
135 : SET
136 : SET
137 : SET
138 : SET
139 : SET
140 : SET
141 : SET
142 : SET
143 : SET
144 : SET
145 : SET
146 : SET
147 : SET
148 : SET
149 : SET
150 : SET
151 : SET
152 : SET
153 : SET
154 : SET
155 : SET
156 : SET
157 : SET
158 : SET
159 : SET
160 : SET
161 : SET
162 : SET
163 : SET
164 : SET
165 : SET
166 : SET
167 : SET
168 : SET
169 : SET
170 : SET
171 : SET
172 : SET
173 : SET
174 : SET
175 : SET
176 : SET
177 : SET
178 : SET
179 : SET
180 : SET
181 : SET
182 : SET
183 : SET
184 : SET
185 : SET
186 : SET
187 : SET
188 : SET
189 : SET
190 : SET
191 : SET
192 : SET
193 : SET
194 : SET
195 : SET
196 : SET
197 : SET
198 : SET
199 : SET
200 : SET
201 : SET
202 : SET
203 : SET
204 : SET
205 : SET
206 : SET
207 : SET
208 : SET
209 : SET
210 : SET
211 : SET
212 : SET
213 : SET
214 : SET
215 : SET
216 : SET
217 : SET
218 : SET
219 : SET
220 : SET
221 : SET
222 : SET
223 : SET
224 : SET
225 : SET
226 : SET
227 : SET
228 : SET
229 : SET
230 : SET
231 : SET
232 : SET
233 : SET
234 : SET
235 : SET
236 : SET
237 : SET
238 : SET
239 : SET
240 : SET
241 : SET
242 : SET
243 : SET
244 : SET
245 : SET
246 : SET
247 : SET
248 : SET
249 : SET
250 : SET
251 : SET
252 : SET
253 : SET
254 : SET
255 : SET
256 : SET
257 : SET
258 : SET
259 : SET
260 : SET
261 : SET
262 : SET
263 : SET
264 : SET
265 : SET
266 : SET
267 : SET
268 : SET
269 : SET
270 : SET
271 : SET
272 : SET
273 : SET
274 : SET
275 : SET
276 : SET
277 : SET
278 : SET
279 : SET
280 : SET
281 : SET
282 : SET
283 : SET
284 : SET
285 : SET
286 : SET
287 : SET
288 : SET
289 : SET
290 : SET
291 : SET
292 : SET
293 : SET
294 : SET
295 : SET
296 : SET
297 : SET
298 : SET
299 : SET
300 : SET
301 : SET
302 : SET
303 : SET
304 : SET
305 : SET
306 : SET
307 : SET
308 : SET
309 : SET
310 : SET
311 : SET
312 : SET
313 : SET
314 : SET
315 : SET
316 : SET
317 : SET
318 : SET
319 : SET
320 : SET
321 : SET
322 : SET
323 : SET
324 : SET
325 : SET
326 : SET
327 : SET
328 : SET
329 : SET
330 : SET
331 : SET
332 : SET
333 : SET
334 : SET
335 : SET
336 : SET
337 : SET
338 : SET
339 : SET
340 : SET
341 : SET
342 : SET
343 : SET
344 : SET
345 : SET
346 : SET
347 : SET
348 : SET
349 : SET
350 : SET
351 : SET
352 : SET
353 : SET
354 : SET
355 : SET
356 : SET
357 : SET
358 : SET
359 : SET
360 : SET
361 : SET
362 : SET
363 : SET
364 : SET
365 : SET
366 : SET
367 : SET
368 : SET
369 : SET
370 : SET
371 : SET
372 : SET
373 : SET
374 : SET
375 : SET
376 : SET
377 : SET
378 : SET
379 : SET
380 : SET
381 : SET
382 : SET
383 : SET
384 : SET
385 : SET
386 : SET
387 : SET
388 : SET
389 : SET
390 : SET
391 : SET
392 : SET
393 : SET
394 : SET
395 : SET
396 : SET
397 : SET
398 : SET
399 : SET
400 : SET
401 : SET
402 : SET
403 : SET
404 : SET
405 : SET
406 : SET
407 : SET
408 : SET
409 : SET
410 : SET
411 : SET
412 : SET
413 : SET
414 : SET
415 : SET
416 : SET
417 : SET
418 : SET
419 : SET
420 : SET
421 : SET
422 : SET
423 : SET
424 : SET
425 : SET
426 : SET
427 : SET
428 : SET
429 : SET
430 : SET
431 : SET
432 : SET
433 : SET
434 : SET
435 : SET
436 : SET
437 : SET
438 : SET
439 : SET
440 : SET
441 : SET
442 : SET
443 : SET
444 : SET
445 : SET
446 : SET
447 : SET
448 : SET
449 : SET
450 : SET
451 : SET
452 : SET
453 : SET
454 : SET
455 : SET
456 : SET
457 : SET
458 : SET
459 : SET
460 : SET
461 : SET
462 : SET
463 : SET
464 : SET
465 : SET
466 : SET
467 : SET
468 : SET
469 : SET
470 : SET
471 : SET
472 : SET
473 : SET
474 : SET
475 : SET
476 : SET
477 : SET
478 : SET
479 : SET
480 : SET
481 : SET
482 : SET
483 : SET
484 : SET
485 : SET
486 : SET
487 : SET
488 : SET
489 : SET
490 : SET
491 : SET
492 : SET
493 : SET
494 : SET
495 : SET
496 : SET
497 : SET
498 : SET
499 : SET
500 : SET
501 : SET
502 : SET
503 : SET
504 : SET
505 : SET
506 : SET
507 : SET
508 : SET
509 : SET
510 : SET
511 : SET
512 : SET
513 : SET
514 : SET
515 : SET
516 : SET
517 : SET
518 : SET
519 : SET
520 : SET
521 : SET
522 : SET
523 : SET
524 : SET
525 : SET
526 : SET
527 : SET
528 : SET
529 : SET
530 : SET
531 : SET
532 : SET
533 : SET
534 : SET
535 : SET
536 : SET
537 : SET
538 : SET
539 : SET
540 : SET
541 : SET
542 : SET
543 : SET
544 : SET
545 : SET
546 : SET
547 : SET
548 : SET
549 : SET
550 : SET
551 : SET
552 : SET
553 : SET
554 : SET
555 : SET
556 : SET
557 : SET
558 : SET
559 : SET
560 : SET
561 : SET
562 : SET
563 : SET
564 : SET
565 : SET
566 : SET
567 : SET
568 : SET
569 : SET
570 : SET
571 : SET
572 : SET
573 : SET
574 : SET
575 : SET
576 : SET
577 : SET
578 : SET
579 : SET
580 : SET
581 : SET
582 : SET
583 : SET
584 : SET
585 : SET
586 : SET
587 : SET
588 : SET
589 : SET
590 : SET
591 : SET
592 : SET
593 : SET
594 : SET
595 : SET
596 : SET
597 : SET
598 : SET
599 : SET
600 : SET
601 : SET
602 : SET
603 : SET
604 : SET
605 : SET
606 : SET
607 : SET
608 : SET
609 : SET
610 : SET
611 : SET
612 : SET
613 : SET
614 : SET
615 : SET
616 : SET
617 : SET
618 : SET
619 : SET
620 : SET
621 : SET
622 : SET
623 : SET
624 : SET
625 : SET
626 : SET
627 : SET
628 : SET
629 : SET
630 : SET
631 : SET
632 : SET
633 : SET
634 : SET
635 : SET
636 : SET
637 : SET
638 : SET
639 : SET
640 : SET
641 : SET
642 : SET
643 : SET
644 : SET
645 : SET
646 : SET
647 : SET
648 : SET
649 : SET
650 : SET
651 : SET
652 : SET
653 : SET
654 : SET
655 : SET
656 : SET
657 : SET
658 : SET
659 : SET
660 : SET
661 : SET
662 : SET
663 : SET
664 : SET
665 : SET
666 : SET
667 : SET
668 : SET
669 : SET
670 : SET
671 : SET
672 : SET
673 : SET
674 : SET
675 : SET
676 : SET
677 : SET
678 : SET
679 : SET
680 : SET
681 : SET
682 : SET
683 : SET
684 : SET
685 : SET
686 : SET
687 : SET
688 : SET
689 : SET
690 : SET
691 : SET
692 : SET
693 : SET
694 : SET
695 : SET
696 : SET
697 : SET
698 : SET
699 : SET
700 : SET
701 : SET
702 : SET
703 : SET
704 : SET
705 : SET
706 : SET
707 : SET
708 : SET
709 : SET
710 : SET
711 : SET
712 : SET
713 : SET
714 : SET
715 : SET
716 : SET
717 : SET
718 : SET
719 : SET
720 : SET
721 : SET
722 : SET
723 : SET
724 : SET
725 : SET
726 : SET
727 : SET
728 : SET
729 : SET
730 : SET
731 : SET
732 : SET
733 : SET
734 : SET
735 : SET
736 : SET
737 : SET
738 : SET
739 : SET
740 : SET
741 : SET
742 : SET
743 : SET
744 : SET
745 : SET
746 : SET
747 : SET
748 : SET
749 : SET
750 : SET
751 : SET
752 : SET
753 : SET
754 : SET
755 : SET
756 : SET
757 : SET
758 : SET
759 : SET
760 : SET
761 : SET
762 : SET
763 : SET
764 : SET
765 : SET
766 : SET
767 : SET
768 : SET
769 : SET
770 : SET
771 : SET
772 : SET
773 : SET
774 : SET
775 : SET
776 : SET
777 : SET
778 : SET
779 : SET
780 : SET
781 : SET
782 : SET
783 : SET
784 : SET
785 : SET
786 : SET
787 : SET
788 : SET
789 : SET
790 : SET
791 : SET
792 : SET
793 : SET
794 : SET
795 : SET
796 : SET
797 : SET
798 : SET
799 : SET
800 : SET
801 : SET
802 : SET
803 : SET
804 : SET
805 : SET
806 : SET
807 : SET
808 : SET
809 : SET
810 : SET
811 : SET
812 : SET
813 : SET
814 : SET
815 : SET
816 : SET
817 : SET
818 : SET
819 : SET
820 : SET
821 : SET
822 : SET
823 : SET
824 : SET
825 : SET
826 : SET
827 : SET
828 : SET
829 : SET
830 : SET
831 : SET
832 : SET
833 : SET
834 : SET
835 : SET
836 : SET
837 : SET
838 : SET
839 : SET
840 : SET
841 : SET
842 : SET
843 : SET
844 : SET
845 : SET
846 : SET
847 : SET
848 : SET
849 : SET
850 : SET
851 : SET
852 : SET
853 : SET
854 : SET
855 : SET
856 : SET
857 : SET
858 : SET
859 : SET
860 : SET
861 : SET
862 : SET
863 : SET
864 : SET
865 : SET
866 : SET
867 : SET
868 : SET
869 : SET
870 : SET
871 : SET
872 : SET
873 : SET
874 : SET
875 : SET
876 : SET
877 : SET
878 : SET
879 : SET
880 : SET
881 : SET
882 : SET
883 : SET
884 : SET
885 : SET
886 : SET
887 : SET
888 : SET
889 : SET
890 : SET
891 : SET
892 : SET
893 : SET
894 : SET
895 : SET
896 : SET
897 : SET
898 : SET
899 : SET
900 : SET
901 : SET
902 : SET
903 : SET
904 : SET
905 : SET
906 : SET
907 : SET
908 : SET
909 : SET
910 : SET
911 : SET
912 : SET
913 : SET
914 : SET
915 : SET
916 : SET
917 : SET
918 : SET
919 : SET
920 : SET
921 : SET
922 : SET
923 : SET
924 : SET
925 : SET
926 : SET
927 : SET
928 : SET
929 : SET
930 : SET
931 : SET
932 : SET
933 : SET
934 : SET
935 : SET
936 : SET
937 : SET
938 : SET
939 : SET
940 : SET
941 : SET
942 : SET
943 : SET
944 : SET
945 : SET
946 : SET
947 : SET
948 : SET
949 : SET
950 : SET
951 : SET
952 : SET
953 : SET
954 : SET
955 : SET
956 : SET
957 : SET
958 : SET
959 : SET
960 : SET
961 : SET
962 : SET
963 : SET
964 : SET
965 : SET
966 : SET
967 : SET
968 : SET
969 : SET
970 : SET
971 : SET
972 : SET
973 : SET
974 : SET
975 : SET
976 : SET
977 : SET
978 : SET
979 : SET
980 : SET
981 : SET
982 : SET
983 : SET
984 : SET
985 : SET
986 : SET
987 : SET
988 : SET
989 : SET
990 : SET
991 : SET
992 : NOTSET
993 : NOTSET
994 : NOTSET
995 : NOTSET
996 : NOTSET
997 : NOTSET
998 : NOTSET
999 : NOTSET
1000 : NOTSET
1001 : NOTSET
1002 : NOTSET
1003 : NOTSET
1004 : NOTSET
1005 : NOTSET
1006 : NOTSET
1007 : NOTSET
1008 : NOTSET
1009 : NOTSET
1010 : NOTSET
1011 : NOTSET
1012 : NOTSET
1013 : NOTSET
1014 : NOTSET
1015 : NOTSET
1016 : NOTSET
1017 : NOTSET
1018 : NOTSET
1019 : NOTSET
1020 : NOTSET
1021 : NOTSET
1022 : NOTSET
1023 : NOTSET
