[
{
  "elements": [
    {
      "keyword": "Scenario", 
      "location": "features/PropertySearch.feature:3", 
      "name": "Login and click summer dresses", 
      "steps": [
        {
          "keyword": "Given", 
          "location": "features/PropertySearch.feature:4", 
          "match": {
            "arguments": [], 
            "location": "features/steps/PropertySearch.py:7"
          }, 
          "name": "I am in the Zoopla home", 
          "result": {
            "duration": 3.0639281272888184, 
            "status": "passed"
          }, 
          "step_type": "given"
        }, 
        {
          "keyword": "When", 
          "location": "features/PropertySearch.feature:5", 
          "match": {
            "arguments": [], 
            "location": "features/steps/PropertySearch.py:13"
          }, 
          "name": "I search for London", 
          "result": {
            "duration": 6.346520900726318, 
            "status": "passed"
          }, 
          "step_type": "when"
        }, 
        {
          "keyword": "And", 
          "location": "features/PropertySearch.feature:6", 
          "match": {
            "arguments": [], 
            "location": "features/steps/PropertySearch.py:22"
          }, 
          "name": "I click on search button", 
          "result": {
            "duration": 0.00011205673217773438, 
            "status": "passed"
          }, 
          "step_type": "when"
        }
      ], 
      "tags": [], 
      "type": "scenario"
    }
  ], 
  "keyword": "Feature", 
  "location": "features/PropertySearch.feature:1", 
  "name": "Property search", 
  "status": "passed", 
  "tags": []
}
]
