0 0 1,Average cost score,Average sustainability score,Average reliability score,Average total score,Total diesel electricity generation,Total wasted energy,Avg Treat_$,Avg Well_$,Avg RO_$,Avg Cistern_$,Avg Waste_$,Avg Diesel_Gen_$,Avg Battery_$,Avg Treat_CF,Avg Well_CF,Avg RO_CF,Avg Cistern_CF,Avg Waste_CF,Avg Diesel_Gen_CF,Avg Battery_CF,Avg H_Well
RL,0.9617272520267337,0.944561022454481,0.856554285554171,0.856554285554171,4988.468329429173,2623.8135647811214,7.469109106084985e-05,0.00014449906990803574,0.0010607967623156892,1.6036479969826643e-05,0.0099148084263025,0.027061844208365826,7.193534343431138e-08,8.50663272107666e-17,0.0037219780166312527,0.002345856843908601,0.000381257608138986,0.009444831989768325,0.03954505011518143,2.971890149257748e-09,228.48
SQ,0.9646576227408439,0.9519280635890853,0.5166387963804578,0.5166387963804578,3411.2609630003035,4139.888087132128,6.557169391831463e-06,4.361735333006221e-06,0.0005617635990804157,1.6036479969826643e-05,0.015643717160853735,0.019109870553870437,7.05606568923323e-08,7.468016722470031e-18,0.00011234870254974663,0.001242289786673899,0.000381257608138986,0.014902182062111706,0.03143385533634319,2.915097240551397e-09,177.5
HU,0.9690916930775082,0.958092457093222,0.4165640267280617,0.4165640267280617,2870.63428300031,3780.2165616847637,9.488438154310422e-06,1.1932301637983038e-05,0.0004964436508435862,1.6036479969826643e-05,0.014284598388440454,0.016089739827734265,6.783571115296359e-08,1.0806463974346303e-17,0.00030734982870582597,0.001097840582963452,0.000381257608138986,0.013607487509514005,0.026513604574935186,2.8025205986189543e-09,162.49
