0.5 0 0.5,Average cost score,Average sustainability score,Average reliability score,Average total score,Total diesel electricity generation,Total wasted energy,Avg Treat_$,Avg Well_$,Avg RO_$,Avg Cistern_$,Avg Waste_$,Avg Diesel_Gen_$,Avg Battery_$,Avg Treat_CF,Avg Well_CF,Avg RO_CF,Avg Cistern_CF,Avg Waste_CF,Avg Diesel_Gen_CF,Avg Battery_CF,Avg H_Well
0,0.9702502266194535,0.9562228182403397,0.4925854990859099,0.7314178628526817,3154.0884870002924,2990.139329851443,4.118890074314618e-05,7.899032031753183e-05,0.0006240925601361486,1.6036479969826643e-05,0.011299072091618971,0.017690325231343115,6.77964177715292e-08,4.691039397474822e-17,0.0020346168036626568,0.0013801246906446853,0.000381257608138986,0.010763479530528797,0.029217700325787688,2.800897257328835e-09,173.89
1,0.9702627246961847,0.9565031724689607,0.4592173108951755,0.7147400177956801,3091.0803000002943,3091.5152655597635,4.0853880742102334e-05,7.910233643631705e-05,0.0005765378713306635,1.6036479969826643e-05,0.011682149226014817,0.017342527457712236,6.80516094789598e-08,4.6528836808743925e-17,0.0020375020923492364,0.0012749617639114185,0.000381257608138986,0.011128398247857958,0.02867470500734176,2.8114400821111737e-09,168.88
2,0.9708435840668744,0.9557523058477133,0.5789358738514436,0.774889728959159,3280.0568350002873,2606.1579866014395,4.75300964981623e-05,9.080371253711211e-05,0.0007397373732253849,1.6036479969826643e-05,0.009848091919590003,0.018414148525535804,6.782576929592841e-08,5.4132436461237867e-17,0.002338903787455037,0.001635862816820434,0.000381257608138986,0.009381277943159405,0.030510389194603044,2.802109867181839e-09,186.84
3,0.9696396068747953,0.9567669139753006,0.38828262131266306,0.6789611140937292,2988.172440000302,3443.0951834764264,3.504264646655399e-05,6.82040297409669e-05,0.000474623496039212,1.6036479969826643e-05,0.013010691611597664,0.016755727029667666,6.783172269471852e-08,3.9910372017816117e-17,0.0017567856976733786,0.0010495872687553214,0.000381257608138986,0.012393965779130515,0.027651486868645388,2.802355822040387e-09,158.24
4,0.9695365626149487,0.9569152626567857,0.38131165315644233,0.6754241078856955,2966.8547480002976,3507.598442958967,3.250544535393617e-05,6.283587266379801e-05,0.0004644661838671665,1.6036479969826643e-05,0.013254435095976968,0.01663309066675655,6.764046293838889e-08,3.7020731807986604e-17,0.0016185137860011299,0.0010271252844045264,0.000381257608138986,0.01262615546546435,0.027431682404751013,2.794454240444346e-09,157.2
5,0.9699805253664652,0.9563731747201311,0.4409434103988205,0.7054619678826428,3080.0829730002974,3191.2135198149913,3.9802055435880796e-05,7.728595198709205e-05,0.000549297806869269,1.6036479969826643e-05,0.012058886774995317,0.01727809757253688,6.799174061096422e-08,4.533090390407245e-17,0.0019907160265699273,0.0012147228058797417,0.000381257608138986,0.011487277885402795,0.028552848144910818,2.8089666985065517e-09,166.14
6,0.96966919979066,0.9566631217451161,0.392462572096845,0.6810658859437525,3001.0223210003064,3413.3459324488813,3.629006541114958e-05,7.084071684468063e-05,0.0004797623733436458,1.6036479969826643e-05,0.012898275802516086,0.016829526826344712,6.794490993708323e-08,4.133106820263189e-17,0.0018247009544497957,0.0010609514347509805,0.000381257608138986,0.012286878643997103,0.027783086806515034,2.8070319664020595e-09,158.87
7,0.9697444121651868,0.9564344889958559,0.40536214386833774,0.6875532780167622,3037.426777000305,3331.5779421988777,3.872729583807997e-05,7.580733921912706e-05,0.00050021751386403,1.6036479969826643e-05,0.01258929273694519,0.017035438369915633,6.809906134820972e-08,4.410685093710007e-17,0.0019526302159070736,0.0011061861423665134,0.000381257608138986,0.01199254182814306,0.02813289239618793,2.8134004778784706e-09,160.8
8,0.9696124444382651,0.956655169838483,0.3920796269979694,0.6808460357181172,3003.354519000306,3426.4577578200056,3.573244148046414e-05,6.962232613727827e-05,0.0004797021521252347,1.6036479969826643e-05,0.012947822477027856,0.016838571862551655,6.782244267140593e-08,4.069598550301518e-17,0.0017933178913511504,0.0010608182609307187,0.000381257608138986,0.012334076733591446,0.027775356865532348,2.801972433172678e-09,158.81
9,0.9700254041666342,0.956026220316696,0.4665927615528547,0.7183090828597445,3135.981002000294,3084.5998152922984,4.210412571314844e-05,8.170455704194307e-05,0.0005839651549347282,1.6036479969826643e-05,0.01165601727612941,0.017594700067738746,6.8171838240554e-08,4.795275157943563e-17,0.0021045295679913223,0.0012913865350770196,0.000381257608138986,0.011103504990659164,0.02909309816503013,2.8164071352338923e-09,169.99
10,0.970093288037504,0.9556418588402535,0.5090777227927317,0.7395855054151179,3218.119553000289,2926.5014683514373,4.3367576923184505e-05,8.331414250264155e-05,0.0006489037021216191,1.6036479969826643e-05,0.011058598753916451,0.01805642358725046,6.771981175066667e-08,4.9391707049509135e-17,0.0021459889469646384,0.0014349923045924768,0.000381257608138986,0.010534404981131161,0.029861494521186676,2.7977324058398996e-09,176.36
11,0.9703366035628569,0.9564971257594953,0.47001993272651355,0.7201782681446852,3099.3279350002963,3055.0451138931,4.09652642269169e-05,7.911095306083901e-05,0.000589766465641687,1.6036479969826643e-05,0.011544336626862668,0.017393112518988094,6.812839326161224e-08,4.665569241937346e-17,0.0020377240376328208,0.0013042156130955568,0.000381257608138986,0.010997118167688953,0.02878255599933596,2.8146122775354707e-09,170.5
12,0.9697524229852702,0.9567486606860051,0.3945685374423058,0.682160480213788,2997.5394460003063,3395.0913261988785,3.625506616049304e-05,7.068217095347692e-05,0.0004843793334218485,1.6036479969826643e-05,0.01282929570183525,0.0168108603240414,6.793834758480598e-08,4.1291207254476035e-17,0.0018206171612318678,0.0010711614276377051,0.000381257608138986,0.012221168301088263,0.027757132009137236,2.806760853633876e-09,159.19
13,0.9694999599788858,0.956713834022043,0.3806409070006527,0.6750704334897693,2984.1310840003002,3490.0785916430978,3.4246005914148894e-05,6.665476065192199e-05,0.0004637636029857009,1.6036479969826643e-05,0.013188231470923052,0.01673103991112082,6.778954870335348e-08,3.9003071228153675e-17,0.001716879935685144,0.0010255715898348078,0.000381257608138986,0.012563089989172433,0.027599364054512056,2.8006134730988385e-09,157.1
14,0.9696000743865509,0.9569098538695108,0.38275800234802493,0.6761790383672879,2969.1860880002987,3485.6846358650105,3.3358633608683087e-05,6.466604371225816e-05,0.00046647355781421107,1.6036479969826643e-05,0.013171627688414232,0.01664769548644872,6.77234812250442e-08,3.799243526310893e-17,0.001665654964234173,0.0010315644117465806,0.000381257608138986,0.012547273250265565,0.027464393098219866,2.7978840041257336e-09,157.41
15,0.9696591977513288,0.9566631638976603,0.3894130080896509,0.6795361029204898,3000.404231000299,3418.0789617680934,3.6446257719203776e-05,7.12336349228811e-05,0.0004768717548599019,1.6036479969826643e-05,0.012916160868591643,0.016823985262111447,6.799049625075586e-08,4.1508956968159726e-17,0.0018348216593811833,0.001054559091378422,0.000381257608138986,0.012303915931753602,0.027762279002772,2.808915289815513e-09,158.41
16,0.9697225716712403,0.9566124562631523,0.39158725229777813,0.6806549119845092,3009.683611000298,3385.8296470591,3.797665973548971e-05,7.452518549026235e-05,0.00047998318447782084,1.6036479969826643e-05,0.012794297874394553,0.01687454078098517,6.816370663759597e-08,4.325194501174497e-17,0.001919604757709914,0.0010614397387586063,0.000381257608138986,0.012187829421911597,0.027837409394257582,2.8160711914602905e-09,158.74
17,0.9707778166174811,0.9563090012020323,0.5396361278360855,0.7552069722267833,3194.665045000295,2769.1779491014354,4.395786319803855e-05,8.392936949350807e-05,0.0006869434384181134,1.6036479969826643e-05,0.010464108133373598,0.01792714011594568,6.798212024465265e-08,5.006398917434582e-17,0.0021618358402124686,0.0015191137677244056,0.000381257608138986,0.009968094086447108,0.029660694686875294,2.8085692489287963e-09,180.95
18,0.9696440360345395,0.9572519909714559,0.37885426517009313,0.6742491506023163,2937.323499000305,3526.6087972681034,3.087012710567436e-05,5.933235313317705e-05,0.0004603711410151957,1.6036479969826643e-05,0.013326271000639236,0.01646301534999583,6.751360158565016e-08,3.515825376375714e-17,0.0015282708336962568,0.0010180694646267354,0.000381257608138986,0.012694586243064469,0.027125822089804474,2.7892131727504107e-09,156.83
19,0.9701437810661747,0.9564923325245591,0.45250411444886385,0.7113239477575193,3083.4492040003056,3138.2706612264274,3.9854581485196855e-05,7.709810957251374e-05,0.0005663404116796774,1.6036479969826643e-05,0.011858827476769135,0.017297993811574642,6.806277444243827e-08,4.5390726274247336e-17,0.0019858776193878163,0.0012524109970137828,0.000381257608138986,0.011296701690836637,0.02859141674816216,2.8119013441750547e-09,167.88
20,0.969554100604229,0.9567118866845408,0.3837538782179139,0.6766539894110715,2988.1089480003034,3468.0362350738837,3.481349376407993e-05,6.781628163747958e-05,0.0004682400468876104,1.6036479969826643e-05,0.013104938303458142,0.016753986967418148,6.782263578311784e-08,3.9649388030395055e-17,0.001746798159912141,0.001035470843807589,0.000381257608138986,0.012483745039802083,0.027640838861817885,2.8019804112647656e-09,157.56
21,0.9695319590733653,0.95686304314629,0.37968061609574194,0.6746062875845537,2968.9607860002993,3505.2314205738803,3.303570574004775e-05,6.403186014744334e-05,0.0004624186624411811,1.6036479969826643e-05,0.01324549064435743,0.016646959873527076,6.770045172013476e-08,3.762464993090071e-17,0.0016493197913624595,0.001022597374515631,0.000381257608138986,0.012617634993947927,0.027466144288812257,2.796932578087918e-09,156.95
22,0.9696434693383981,0.9571703866038415,0.37887266666435054,0.6742580680013743,2943.5446590003075,3516.2079060180986,3.166703939139201e-05,6.107118796170462e-05,0.00046059195214937063,1.6036479969826643e-05,0.013286968343777196,0.016500128063685702,6.759466688975432e-08,3.6065864032830724e-17,0.0015730593919233188,0.001018557768634362,0.000381257608138986,0.012657146589684113,0.02719958924521555,2.7925622521766274e-09,156.83
23,0.9695066341983739,0.9566399671820849,0.37962532771793117,0.6745659809581526,2993.8675360003085,3474.077238851432,3.5562146213488565e-05,6.954477651658081e-05,0.00046310116958317633,1.6036479969826643e-05,0.013127765914368053,0.016781287362682463,6.795229267060474e-08,4.0502034756048755e-17,0.0017913203837989034,0.0010241066778119293,0.000381257608138986,0.012505490588530992,0.027657854752297414,2.8073369718691874e-09,156.94
24,0.9707147839313831,0.9567139279383248,0.4991101184656002,0.7349124511984917,3116.7898520003,2918.5925738097653,4.215727674908337e-05,8.101178043037908e-05,0.000629512469793169,1.6036479969826643e-05,0.011028712798871097,0.01748771734391228,6.791889094886693e-08,4.801328575225617e-17,0.002086685167191244,0.0013921103344682322,0.000381257608138986,0.010505935664113567,0.028920080481806054,2.805957034788725e-09,174.87
25,0.9695713575932632,0.9567565652398797,0.3826853978128602,0.6761283777030617,2980.5890400003027,3474.5266747264272,3.44662457639713e-05,6.709076185273216e-05,0.00046633304163791787,1.6036479969826643e-05,0.013129464232670973,0.01671518379826752,6.784657375935109e-08,3.925390429088909e-17,0.0017281103670344466,0.0010312536728326368,0.000381257608138986,0.0125071084040597,0.027595701905085167,2.802969369297971e-09,157.4
26,0.9615198369814654,0.9483001401161114,0.2357020274594608,0.5986109322204631,3367.7364600000637,5175.051065976206,4.430046455850259e-05,9.678881993005186e-05,5.138877304434031e-06,1.0336238574101794e-05,0.019555368035368455,0.018768161776653622,6.880614539538651e-08,5.0454180815921125e-17,0.002493066981431833,1.1364165995659038e-05,0.00024573781798316763,0.018628414957788504,0.030321273118076936,2.842612489862828e-09,135.36
27,0.969536583887433,0.9569487657226848,0.3791560382838493,0.6743463110856411,2958.6070360003027,3520.065604975779,3.208292722625096e-05,6.197248688669959e-05,0.00046105364815719085,1.6036479969826643e-05,0.013301545730922803,0.016590657220945278,6.761845888227309e-08,3.653952227159266e-17,0.0015962748685861066,0.0010195787679230341,0.000381257608138986,0.012671032987335,0.02738308725178677,2.7935451791332816e-09,156.87
28,0.9695293125983585,0.9569903934937586,0.378786126942009,0.6741577197701838,2956.868200000301,3525.9936155597634,3.1776738129668765e-05,6.131073012341456e-05,0.00046061202588884104,1.6036479969826643e-05,0.013323946365662349,0.016576937454225983,6.760764142988807e-08,3.6190800871111155e-17,0.001579229470806928,0.0010186021599077823,0.000381257608138986,0.012692371799189193,0.027338142675100152,2.7930982739174543e-09,156.82
29,0.9694690881662943,0.9565285716940548,0.38012477741944517,0.6747969327928698,3003.9651180003016,3468.765643976427,3.6389927403511984e-05,7.136288429071021e-05,0.0004626595473148264,1.6036479969826643e-05,0.013107694577619641,0.01683670044314563,6.797396152819608e-08,4.1444801886228757e-17,0.0018381508386349295,0.0010231300697966775,0.000381257608138986,0.012486370662532628,0.02774251631860966,2.808232185005692e-09,157.02
30,0.9698901335609015,0.9567286507885774,0.42058477883357626,0.6952374561972389,3029.1789550003014,3302.250187851425,3.635549879281179e-05,7.023755312814481e-05,0.0005217767100552884,1.6036479969826643e-05,0.01247846967015733,0.016986922724975678,6.780201934806903e-08,4.1405590844836315e-17,0.0018091647845989813,0.0011538623700201771,0.000381257608138986,0.011886971936986568,0.028040089710549148,2.801128677230989e-09,163.09
31,0.9696427812182535,0.9572658103699854,0.3793537506373888,0.6744982659278211,2935.823825000308,3529.0306151673017,3.0594480833422854e-05,5.871884946721491e-05,0.00046097335319930915,1.6036479969826643e-05,0.013335422512330561,0.01645540559923523,6.750671099324681e-08,3.484431784908866e-17,0.0015124683295051427,0.001019401202829352,0.000381257608138986,0.012703303959702114,0.027117755740910538,2.7889284992824263e-09,156.9
32,0.9698865734488483,0.9568666443210894,0.4056410215837015,0.6877637975162749,2999.791256000302,3352.435482393089,3.603463609735185e-05,6.992735464535495e-05,0.0004997357441167393,1.6036479969826643e-05,0.012668108746605846,0.01682351568733552,6.790238085853406e-08,4.1040157556152826e-17,0.0018011747543899912,0.0011051207518044206,0.000381257608138986,0.012067621843544476,0.027778177915757797,2.8052749476187585e-09,160.85
33,0.9696545729478335,0.9568130354492713,0.38955130840330615,0.6796029406755698,2985.0458880002993,3443.6760690591036,3.462129679211276e-05,6.725620104355344e-05,0.0004761089527600249,1.6036479969826643e-05,0.013012886649136602,0.016738449671289336,6.780117496703346e-08,3.943049324289011e-17,0.0017323717164792417,0.0010528722229884418,0.000381257608138986,0.012396056768676162,0.027624403433352093,2.8010937930202246e-09,158.43
34,0.9698197681330619,0.9567622029861441,0.40107538542365856,0.6854475767783602,3003.0139810003006,3366.054538851424,3.644612185254748e-05,7.09320530646132e-05,0.0004938340647124283,1.6036479969826643e-05,0.012719572134684885,0.01684334310444664,6.790820709584347e-08,4.1508802228454153e-17,0.0018270535744557767,0.001092069717418781,0.000381257608138986,0.012116645791676574,0.02782076751665002,2.80551564901032e-09,160.16
35,0.969880275387882,0.9565280437676889,0.4332968681479434,0.7015885717679127,3054.3773260003027,3261.458639684755,3.721749120688536e-05,7.186092518807836e-05,0.0005365108348265951,1.6036479969826643e-05,0.012324327473884875,0.01713370354533337,6.786170812670339e-08,4.2387321432879835e-17,0.0018509792760260306,0.0011864455647108557,0.000381257608138986,0.011740136306510334,0.02831313467333028,2.8035946207404778e-09,164.99
36,0.9698564187357984,0.9562487979073019,0.4317701682595549,0.7008132934976766,3080.4129180003024,3225.8089452264226,3.9821375674403156e-05,7.751860084918441e-05,0.0005385784299920511,1.6036479969826643e-05,0.012189615200210016,0.01728194307971087,6.80977952684588e-08,4.535290789020506e-17,0.0019967085492266705,0.0011910178658731715,0.000381257608138986,0.01161180959185154,0.02857040566425955,2.813348171880329e-09,164.77
37,0.9697653019780931,0.9563814407917222,0.41875818662579667,0.6942617443019449,3055.114711000305,3295.005716198883,3.84004006630814e-05,7.476300432706788e-05,0.0005187656491347214,1.6036479969826643e-05,0.012451094421569203,0.017135570056441198,6.800980204316581e-08,4.3734547205489084e-17,0.0019257304475368067,0.0011472036790070956,0.000381257608138986,0.011860894315263987,0.028303470348617816,2.809712876808883e-09,162.81
38,0.9702148530738027,0.9563387380011866,0.4670092999925788,0.7186120765331907,3112.451573000297,3068.9549519237935,4.119496039601606e-05,7.965035375591247e-05,0.0005876787967367607,1.6036479969826643e-05,0.011596898813889377,0.017463619526484637,6.799496461074466e-08,4.691729536561683e-17,0.00205161781238512,0.00129959892065982,0.000381257608138986,0.011047188830089755,0.02888159601843987,2.809099892743643e-09,170.05
39,0.9696104227133626,0.956111863392412,0.4085234896288901,0.6890669561711263,3065.3656220003,3322.578668423784,3.9794881676429455e-05,7.807178814349298e-05,0.0005041720405397075,1.6036479969826643e-05,0.012555286481068817,0.01719614743172966,6.818350923316553e-08,4.5322733647618134e-17,0.0020109574364327028,0.0011149312232303608,0.000381257608138986,0.011960147518586725,0.028420840004309802,2.8168893030573617e-09,161.28
40,0.9705923832377625,0.9554734003525636,0.572425963259522,0.7715091732486423,3298.8392910002854,2647.5810534654697,4.744142991827697e-05,9.072960956622342e-05,0.0007329925967633154,1.6036479969826643e-05,0.010004620484690639,0.018515728371862106,6.778946718668254e-08,5.403145332938029e-17,0.002336995058016222,0.0016209473489511316,0.000381257608138986,0.009530386825087278,0.03065701000663254,2.8006101053719354e-09,185.86
41,0.9695087570790293,0.956967750237927,0.3787447342323927,0.674126745655711,2959.6297940003087,3527.6721752089634,3.180198215440473e-05,6.136415319545062e-05,0.0004607123945861932,1.6036479969826643e-05,0.013330289269585616,0.016590971041961083,6.759951815172637e-08,3.6219551508406785e-17,0.0015806055315651431,0.001018824116274885,0.000381257608138986,0.012698414040179297,0.0273531456731518,2.7927626740690924e-09,156.81
42,0.9697231804699149,0.9567853047404269,0.39733328286130876,0.6835282316656118,2995.9731780003012,3405.4053981430966,3.51810402426361e-05,6.827813271185557e-05,0.00048749076303976764,1.6036479969826643e-05,0.012868270287832748,0.01680149503829659,6.77879918326819e-08,4.0067989881913773e-17,0.001758694427112193,0.0010780420750178894,0.000381257608138986,0.012258295434643419,0.027738402914111383,2.800549153553096e-09,159.6
43,0.9696441238942454,0.9565973236674569,0.38839207012153665,0.679018097007891,3005.039213000303,3414.821130851427,3.700040346348856e-05,7.246581222951858e-05,0.0004757275517100864,1.6036479969826643e-05,0.012903850249476928,0.016850727601515014,6.800738974199214e-08,4.214007833131374e-17,0.0018665598349335616,0.0010520287887934511,0.000381257608138986,0.012292188854009964,0.027810638437053788,2.8096132165618764e-09,158.26
44,0.9705423989068408,0.9568259639036253,0.49064975192268034,0.7305960754147606,3095.691137000297,3001.3906356847747,3.882310900408539e-05,7.39082351744914e-05,0.0006189336090922442,1.6036479969826643e-05,0.011341588276221667,0.017368243584450698,6.779924625130989e-08,4.421597337747084e-17,0.001903713475405367,0.001368716133375606,0.000381257608138986,0.010803980385729706,0.028716365692710917,2.801014111309039e-09,173.6
45,0.9696637640097826,0.9573119138811896,0.37931767378253645,0.6744907188961595,2931.4067310003043,3530.0839130180993,3.0365165090961255e-05,5.8217361920037974e-05,0.0004609733531993091,1.6036479969826643e-05,0.01333940269085646,0.01643117344727326,6.749190759508105e-08,3.458314817402091e-17,0.0014995511140006084,0.001019401202829352,0.000381257608138986,0.012707095471938164,0.027080777933586618,2.788316921286354e-09,156.9
46,0.9696805708678308,0.9567810300141832,0.3939823566052845,0.6818314637365577,2991.7265400003043,3424.3578270738826,3.481680891049306e-05,6.756467620143891e-05,0.0004828135817431537,1.6036479969826643e-05,0.01293988730536179,0.016778242515410935,6.776457174889332e-08,3.9653163679211066e-17,0.0017403173576315157,0.001067698908310903,0.000381257608138986,0.012326517700680922,0.027703175611472685,2.799581591392646e-09,159.1
47,0.9702517095858731,0.9566131763831897,0.4564357416502513,0.7133437256180623,3075.872635000297,3119.074018559107,3.9655129233784595e-05,7.657421880157976e-05,0.0005712785515894069,1.6036479969826643e-05,0.01178628762979622,0.017258390430838155,6.797389773559657e-08,4.516356838646474e-17,0.0019723833461459664,0.0012633312502752362,0.000381257608138986,0.01122760033882209,0.02854224826519844,2.808229549519587e-09,168.47
48,0.9695211296873458,0.956851263991447,0.3781468917638245,0.6738340107255851,2967.6869640003015,3510.3455458097624,3.309983480180973e-05,6.421453258730848e-05,0.00046002988744419813,1.6036479969826643e-05,0.01326481578721914,0.01664060606635315,6.772427864539811e-08,3.7697687071931623e-17,0.0016540250313744204,0.0010173148129785862,0.000381257608138986,0.012636044096742372,0.027460091661401533,2.7979169482333387e-09,156.72
49,0.9695164122097257,0.9568731021935395,0.3780402337897433,0.6737783229997345,2964.4663400003014,3516.4755097264297,3.271709843108196e-05,6.338216665848905e-05,0.0004597689288310823,1.6036479969826643e-05,0.013287979558727032,0.016623635859000004,6.769865675798571e-08,3.726178532132975e-17,0.001632585116980296,0.0010167377264241194,0.000381257608138986,0.012658109871564719,0.027438204686494043,2.796858422185208e-09,156.71
50,0.9704209494419149,0.9564921959735868,0.4804999637726538,0.7254604566072844,3112.9121320002946,3008.470801392447,4.14576449892589e-05,7.991746911609263e-05,0.0006049823601602846,1.6036479969826643e-05,0.011368342649154385,0.017468245931369475,6.802332591295462e-08,4.721646911237354e-17,0.0020584981161761947,0.001337864198348328,0.000381257608138986,0.010829466562212028,0.028900714731266073,2.8102715931989956e-09,172.08
51,0.9696560078593383,0.9571931507036697,0.3786044840213476,0.6741302459403429,2940.189571000302,3517.5705094816617,3.1483048765463886e-05,6.0673099908790984e-05,0.00046035106727572526,1.6036479969826643e-05,0.013292117319483236,0.016483263532599594,6.759265928682383e-08,3.5856315523542445e-17,0.0015628055198217811,0.001018025073353315,0.000381257608138986,0.012662051496402623,0.027182706806134244,2.7924793113705104e-09,156.79
52,0.9698294964627456,0.9562010247855329,0.4288806494984604,0.6993550729806031,3085.058042000297,3227.7432238097576,4.0527012740435e-05,7.913163295969167e-05,0.0005346439770558438,1.6036479969826643e-05,0.012196924409162323,0.017303171944097594,6.808126855173645e-08,4.615656402507405e-17,0.0020382567063134197,0.0011823171762827456,0.000381257608138986,0.011618772333597467,0.02857836857746898,2.8126653978184854e-09,164.33
53,0.9695200863986337,0.9568393577170083,0.3818734386400355,0.6756967625193346,2976.117716000302,3498.1314144764265,3.3286732974182156e-05,6.453162436971586e-05,0.00046518883848810263,1.6036479969826643e-05,0.013218661299000454,0.016682140957793846,6.766877021262697e-08,3.7910547010919196e-17,0.001662192617810277,0.0010287233702476657,0.000381257608138986,0.012592077398844034,0.02749638849232715,2.7956237088230888e-09,157.28
54,0.9695717962240825,0.9566963356526856,0.3858003668359939,0.6776860815300382,2993.227710000302,3455.0134257922928,3.517291541659084e-05,6.854524807203571e-05,0.0004714518452028816,1.6036479969826643e-05,0.01305572800096854,0.01678120144274843,6.784353913999217e-08,4.005873644752044e-17,0.0017655747309032678,0.0010425734475548757,0.000381257608138986,0.012436867377703545,0.027677388380169816,2.8028439990008554e-09,157.87
55,0.9696788937259602,0.9572625990655552,0.378762301854092,0.6742205977900261,2932.693027000305,3522.6080896566823,3.0882844224701736e-05,5.936337298145603e-05,0.0004601904773599616,1.6036479969826643e-05,0.013311153215568952,0.01644341233140706,6.755252781165003e-08,3.5172737400198865e-17,0.001529069836717156,0.0010176699431659506,0.000381257608138986,0.012680185063141782,0.027129215692459515,2.790821345618903e-09,156.81
56,0.9696480471861163,0.9561643640770623,0.4139749836883004,0.6918115154372083,3069.0867900002995,3306.559436809757,3.9618553929915255e-05,7.755996064688975e-05,0.0005112781443122454,1.6036479969826643e-05,0.012494753364416937,0.017212638219073585,6.809153423377392e-08,4.512191245772423e-17,0.001997773886587869,0.0011306457340212331,0.000381257608138986,0.011902483760295908,0.028423472120804205,2.81308950755184e-09,162.1
57,0.9707271939562674,0.9563974224761687,0.5048706273263224,0.7377989106412949,3145.9146620002944,2866.884245476433,4.544255967115348e-05,8.813428226021498e-05,0.0006330053004610267,1.6036479969826643e-05,0.0108333185161557,0.017656800522897805,6.838231685952693e-08,5.175492278097599e-17,0.0022701451386010034,0.0013998344160434067,0.000381257608138986,0.010319803356492522,0.029231534179452533,2.825102712463272e-09,175.73
58,0.9695673362994014,0.9562682870660069,0.4023906258728566,0.685978981086129,3043.6805630003028,3370.483122934758,3.7968344696125667e-05,7.424600685575146e-05,0.0004946771617701869,1.6036479969826643e-05,0.012736306769864527,0.017073360805749508,6.813169262424707e-08,4.3242474941763847e-17,0.0019124137305218233,0.001093934150902444,0.000381257608138986,0.012132587180646073,0.028211517449035245,2.814748585264678e-09,160.36
59,0.9694755627687388,0.9568787648573834,0.3785522929160023,0.6740139278423706,2968.190764000305,3523.6571308097646,3.240726810811156e-05,6.26928366967338e-05,0.00046043136223360707,1.6036479969826643e-05,0.013315117308980058,0.016637684347684898,6.762758802165211e-08,3.690891689673885e-17,0.0016148294942936515,0.0010182026384469973,0.000381257608138986,0.01268396125272103,0.027422981355093513,2.7939223344799643e-09,156.78
60,0.9695001674795602,0.9568323827473256,0.3782376341861946,0.6738689008328774,2972.2643280003026,3510.086980643097,3.328920574732636e-05,6.462296058964844e-05,0.00046035106727572526,1.6036479969826643e-05,0.013263838726909808,0.01666162634158025,6.773836707094276e-08,3.7913363273560635e-17,0.0016645452378162575,0.001018025073353315,0.000381257608138986,0.012635113350522309,0.027468673184344396,2.798498988313996e-09,156.74
61,0.9697907878594468,0.9567547539299212,0.39690340731774804,0.6833470975885975,2998.8681580003004,3381.372773143096,3.6449572865616885e-05,7.104406918339842e-05,0.00048795245904758775,1.6036479969826643e-05,0.012777456338223482,0.016820205254984275,6.796627887867306e-08,4.1512732616975737e-17,0.0018299388631423557,0.0010790630743065619,0.000381257608138986,0.012171786199214179,0.02778319751736199,2.8079147890032868e-09,159.54
62,0.9694935087553971,0.9569124968320419,0.37853994378666306,0.67401672627103,2964.316718000303,3524.501568559766,3.223466310797932e-05,6.231715186757721e-05,0.0004603309935362548,1.6036479969826643e-05,0.013318308251595634,0.01661719608646046,6.761806519247547e-08,3.6712335574777665e-17,0.0016051526799294301,0.0010179806820798942,0.000381257608138986,0.01268700093998449,0.027396108464296343,2.7935289144881772e-09,156.78
63,0.9699669074986194,0.9565289601663896,0.4233298872934465,0.6966483973960329,3050.3196350003063,3246.102715559757,3.9485132873452826e-05,7.701538997710311e-05,0.0005255104255967912,1.6036479969826643e-05,0.012266300848841151,0.017108676154387867,6.806973456614557e-08,4.4969958066850575e-17,0.0019837469446654194,0.001162119146876398,0.000381257608138986,0.011684860228455475,0.028259053093285223,2.812188890214259e-09,163.5
64,0.9695272005245971,0.9567397439963984,0.38196599385763297,0.675746597191115,2983.331318000303,3483.445398559758,3.4230951888633585e-05,6.658582765574646e-05,0.00046579105067221606,1.6036479969826643e-05,0.013163166108216376,0.016726921292144332,6.776485588036843e-08,3.8985926068776075e-17,0.0017151043734164792,0.0010300551084502824,0.000381257608138986,0.012539212761358418,0.02759462335264399,2.799593329816231e-09,157.3
65,0.9695308012028949,0.9569309289470566,0.37902314765493544,0.6742769744289152,2960.6589100003034,3518.524819573885,3.2219772122451544e-05,6.226889877025434e-05,0.00046121423807295436,1.6036479969826643e-05,0.013295723445265448,0.016601668322043284,6.764086080742985e-08,3.669537610304678e-17,0.0016039097863413641,0.0010199338981103985,0.000381257608138986,0.01266548668654272,0.02739848027933937,2.794470677748001e-09,156.85
66,0.9695911338408424,0.9567117739080404,0.38243711639837036,0.6760141251196063,2984.5975280003045,3462.413225226432,3.523171850542682e-05,6.87658336597974e-05,0.0004662728204195067,1.6036479969826643e-05,0.013083690198728053,0.016738801193941416,6.79139335843936e-08,4.012570779209286e-17,0.0017712565301629944,0.0010311204990123756,0.000381257608138986,0.012463504126347388,0.027641084522545562,2.8057522294462977e-09,157.37
67,0.9695974534194556,0.9566318324738351,0.3857617824025085,0.6776796179109821,2995.8067040003016,3442.1481128930986,3.592262762591842e-05,7.018585338101317e-05,0.00047139162398447025,1.6036479969826643e-05,0.013007112842310873,0.01680182923956413,6.791370810788495e-08,4.091259014287764e-17,0.0018078331128974833,0.0010424402737346137,0.000381257608138986,0.0123905566487479,0.027746077076902912,2.805742914255976e-09,157.86
68,0.9702487872545523,0.956150996145153,0.4873588669193534,0.7288038270869528,3148.017840000294,2999.695484726439,4.228808916574531e-05,8.1597710897871e-05,0.0006126304548985244,1.6036479969826643e-05,0.011335182677427925,0.01766340924221347,6.809087445389084e-08,4.8162269140782785e-17,0.0021017774464748918,0.0013547772735215554,0.000381257608138986,0.01079787842169778,0.029213310291951542,2.8130622498334274e-09,173.1
69,0.969524121916958,0.9568866771387055,0.37897861925775345,0.6742513705873557,2965.7259940003028,3512.7173091430914,3.273073944337201e-05,6.338561330829783e-05,0.0004612543855518954,1.6036479969826643e-05,0.013273778153828622,0.016628625028197706,6.768274219735279e-08,3.727732118776937e-17,0.0016326738950937299,0.0010200226806572393,0.000381257608138986,0.012644581634051995,0.0274347842471518,2.7962009383432374e-09,156.85
70,0.9694896369997319,0.9568255096986045,0.3777694457641476,0.6736295413819398,2971.6683480002944,3513.8512265071276,3.321067481999919e-05,6.446441469844474e-05,0.0004596083389153188,1.6036479969826643e-05,0.013278062975580646,0.016658912394912424,6.772137167625619e-08,3.782392372373887e-17,0.0016604614445983289,0.0010163825962367554,0.000381257608138986,0.012648663348979195,0.027467722505645338,2.797796851594541e-09,156.67
71,0.969555824043435,0.9570708045923665,0.3790232010828304,0.6742895125631327,2949.395328000301,3530.2321112923023,3.1166262069692186e-05,5.9969983347800656e-05,0.0004609332057203681,1.6036479969826643e-05,0.01333996269920368,0.016536039757291437,6.75689620708569e-08,3.549552442602617e-17,0.0015446947846814035,0.001019312420282511,0.000381257608138986,0.012707628935069763,0.02727629886796044,2.791500299950883e-09,156.85
72,0.96986576519999,0.9563837567829172,0.42698679863586364,0.6984262819179268,3064.1400570003007,3251.229502148317,3.9201959588443664e-05,7.632089004063471e-05,0.0005297459846250551,1.6036479969826643e-05,0.012285673836141174,0.0171871875998312,6.804981371653734e-08,4.464744957249332e-17,0.001965858154808624,0.0011714857055681327,0.000381257608138986,0.011703314907791813,0.02839432402940942,2.8113658931464876e-09,164.05
73,0.9698405767410232,0.9567941647023178,0.4007234457243765,0.6852820112326998,3000.2120170003036,3365.1111256847566,3.6526364699743734e-05,7.112678877880904e-05,0.0004927500827810242,1.6036479969826643e-05,0.012716007185962956,0.016826908405781597,6.795100273610029e-08,4.160019149856615e-17,0.0018320695378647536,0.0010896725886540715,0.000381257608138986,0.012113249826743814,0.027789582928996855,2.8072836803512214e-09,160.11
74,0.9703321288447195,0.9561770030338509,0.4993607902264554,0.7348464595355875,3163.366624000293,2950.384857059774,4.217887954743116e-05,8.099627050623957e-05,0.0006330454479399674,1.6036479969826643e-05,0.011148848772741174,0.017746697406963365,6.789761239829128e-08,4.8037889365442437e-17,0.0020862856656807946,0.0013999231985902473,0.000381257608138986,0.010620377016920745,0.02933515067174038,2.8050779465432637e-09,174.9
75,0.9696510189161652,0.9563319686969299,0.40566428015931033,0.6876576495377378,3040.643947000303,3350.6828623514275,3.802747386493672e-05,7.429081330326555e-05,0.0004994346380246824,1.6036479969826643e-05,0.012661485984916343,0.017059637570575714,6.812318005071857e-08,4.330981766162965e-17,0.0019135678459964542,0.0011044548827031126,0.000381257608138986,0.012061313010456013,0.028207435141378457,2.814396902319877e-09,160.85
76,0.9695327636920703,0.956671546941058,0.38361259477319876,0.6765726792326345,2994.3153240003026,3465.2885843566596,3.525223437052441e-05,6.877789693412811e-05,0.0004681196044507876,1.6036479969826643e-05,0.01309455554195049,0.016784426700990382,6.784926363967987e-08,4.014907348763453e-17,0.0017715672535600108,0.0010352044961670656,0.000381257608138986,0.012473854436392193,0.02766656646160339,2.8030804972702597e-09,157.54
77,0.9698113529705491,0.9567616315839,0.4095518662170899,0.6896816095938195,3010.515002000308,3355.0877183930947,3.563206319480788e-05,6.895712272418446e-05,0.0005047943264632915,1.6036479969826643e-05,0.012678130957099115,0.016885028192308787,6.788769103998883e-08,4.0581663808537134e-17,0.0017761837154585385,0.0011163073527063975,0.000381257608138986,0.012077168986585979,0.02788744794854194,2.804668061977505e-09,161.43
78,0.9696048890332786,0.9568739185976131,0.3848150356897223,0.6772099623615004,2972.9158360003007,3477.042224559106,3.340436632518539e-05,6.47022335352503e-05,0.0004700667571794209,1.6036479969826643e-05,0.01313896993651083,0.016671863482985605,6.771021541347158e-08,3.804452064800514e-17,0.001666587134425222,0.0010395104496888578,0.000381257608138986,0.012516163523619419,0.027522559889178518,2.7973359489854867e-09,157.72
79,0.9696688580706453,0.9572563733849911,0.37883362654832053,0.6742512423094829,2933.951515000302,3523.6945870487975,3.086474678608586e-05,5.932201318375073e-05,0.00046029084605731386,1.6036479969826643e-05,0.013315258847784239,0.016449301462338913,6.753323467918781e-08,3.51521260714164e-17,0.0015280044993559573,0.0010178918995330534,0.000381257608138986,0.012684096082378651,0.027132373735577944,2.790024281650407e-09,156.83
80,0.9701235269139111,0.9566221750045162,0.4390727847745931,0.7045981558442521,3063.9992350003017,3179.300867673791,3.970262821681847e-05,7.707742967366108e-05,0.0005487959633825079,1.6036479969826643e-05,0.01201387150965232,0.017180921118392575,6.79568013270386e-08,4.521766538753341e-17,0.001985344950707217,0.001213613024044228,0.000381257608138986,0.011444396409547797,0.028353210195522203,2.807523239578528e-09,165.86
81,0.969638472683417,0.9568559820207722,0.38893402193419985,0.6792862473088084,2980.140306000304,3455.984737393093,3.3904355620278796e-05,6.569831532998662e-05,0.0004755468880548524,1.6036479969826643e-05,0.013059398371673778,0.0167108751699614,6.773597301664657e-08,3.8613962764517365e-17,0.0016922440092074238,0.001051629267332666,0.000381257608138986,0.012440363767463245,0.027578520528685552,2.798400081906658e-09,158.34
82,0.9696270796080768,0.95660807508196,0.38652098506156496,0.6780740323348209,3000.572597000305,3426.504378601427,3.6658916209606e-05,7.17678656432414e-05,0.0004729774494026354,1.6036479969826643e-05,0.012947998646601306,0.016827413005839273,6.802825722213435e-08,4.175115555532411e-17,0.0018485822669633335,0.0010459471843348367,0.000381257608138986,0.012334244552469172,0.02778189049565806,2.8104753221099105e-09,157.98
83,0.9698909943137751,0.9568117644988879,0.40282282354285975,0.6863569089283175,3000.5049250003035,3349.7699224347607,3.6788831906336516e-05,7.164550957502986e-05,0.0004958615123989433,1.6036479969826643e-05,0.012658036187834742,0.016830569172892766,6.799164730255021e-08,4.189911766179394e-17,0.001845430643936454,0.0010965532360342558,0.000381257608138986,0.012058026738807221,0.02780696446523225,2.8089628436232186e-09,160.42
84,0.9695062529863254,0.9568282244042238,0.378236181698094,0.6738712173422097,2972.4787400003024,3507.9656101430933,3.341558891099373e-05,6.490041589925493e-05,0.00046029084605731397,1.6036479969826643e-05,0.013255822539177942,0.016663213413053515,6.773060584616205e-08,3.805730214768555e-17,0.0016716918759476325,0.0010178918995330534,0.000381257608138986,0.01262747714182612,0.02747345427215202,2.798178346104328e-09,156.74
85,0.9696758413994837,0.9562232785129764,0.41056412104839257,0.6901199812239381,3058.8213700003025,3314.808943893097,3.942796018449215e-05,7.72187423158209e-05,0.0005070225115445108,1.6036479969826643e-05,0.01252592641857009,0.017158458313990745,6.817394076065732e-08,4.4904843598745046e-17,0.00198898485335798,0.0011212347840560777,0.000381257608138986,0.01193217916603904,0.02835306225893749,2.816493997386561e-09,161.59
86,0.970091832159275,0.9563254254903382,0.4414055820009554,0.7057487070801152,3082.8681180002986,3154.85696772643,4.190983639467464e-05,8.191824933008719e-05,0.0005480130875431606,1.6036479969826643e-05,0.01192150344340595,0.017298718473250794,6.827083045069549e-08,4.7731473800464844e-17,0.0021100338110241817,0.001211881764380827,0.000381257608138986,0.01135640672488557,0.028614991780735535,2.8204968352356927e-09,166.21
87,0.9696646202389536,0.9572457180960705,0.3786065131774702,0.6741355667082118,2934.6008010003034,3523.7859142680986,3.090061558334256e-05,5.940473277916135e-05,0.0004600499611836686,1.6036479969826643e-05,0.013315603953052256,0.016453316473169617,6.754530874168995e-08,3.519297735368793e-17,0.0015301351740783546,0.0010173592042520068,0.000381257608138986,0.012684424829151665,0.027141102297785488,2.7905231016420637e-09,156.79
88,0.9696287171262793,0.957139047290481,0.3781067747003916,0.6738677459133354,2946.332345000304,3516.3147874347687,3.193105547786634e-05,6.166745837862289e-05,0.000459528043957437,1.6036479969826643e-05,0.013287372224900769,0.016514679988423632,6.762261257283262e-08,3.636655422870206e-17,0.0015884180055472665,0.0010162050311430728,0.000381257608138986,0.01265753132625107,0.02721753794472162,2.793716782012584e-09,156.72
89,0.9698091584035409,0.9565821789588003,0.4088343103813193,0.68932173439243,3022.5251980003027,3334.892318375628,3.728729949487966e-05,7.25933382724433e-05,0.0005038709344476509,1.6036479969826643e-05,0.01260181702803289,0.01695916854002007,6.79762214271631e-08,4.246682669360375e-17,0.0018698446251305915,0.0011142653541290526,0.000381257608138986,0.012004472449495304,0.02804797819598032,2.80832554900672e-09,161.33
90,0.9696498624076484,0.9571788400986568,0.37857975949027467,0.6741148109489615,2940.5407790003023,3518.403185406683,3.146139162045359e-05,6.063001678618128e-05,0.0004601101824020798,1.6036479969826643e-05,0.013295263816775801,0.016486568115244005,6.758955334217403e-08,3.583165001447396e-17,0.0015616957934038661,0.0010174923780722686,0.000381257608138986,0.012665048845116463,0.027195662484260676,2.79235099438656e-09,156.79
91,0.9695135105444753,0.9566394323989114,0.3829548238686895,0.6762341672065824,2993.2603910003095,3471.285292184759,3.511541664765508e-05,6.850044162452162e-05,0.0004668951063430906,1.6036479969826643e-05,0.013117215768310408,0.01678265842332214,6.781930720435636e-08,3.9993250604121537e-17,0.0017644206154286354,0.001032496628488412,0.000381257608138986,0.012495440534843855,0.02768694941234594,2.801842896519441e-09,157.44
92,0.9698912957346874,0.9561780888539814,0.44577118434334295,0.7078312400390152,3101.680164000297,3179.9166810316765,3.993871011876258e-05,7.742898795415626e-05,0.0005580700310178537,1.6036479969826643e-05,0.012016198531492495,0.017400963501375426,6.802338422910624e-08,4.548654109993872e-17,0.0019944003182774065,0.001234121792364519,0.000381257608138986,0.011446613127145549,0.02876551548981813,2.8102740024346834e-09,166.87
93,0.969623048672231,0.9567435398597721,0.3883159907862128,0.6789695197292219,2990.2293520003022,3444.359173809758,3.5027592441038686e-05,6.816611659307033e-05,0.00047490452839179826,1.6036479969826643e-05,0.013015467950197295,0.01676728084751494,6.781266099755925e-08,3.989322685843852e-17,0.0017558091384256135,0.0010502087465832086,0.000381257608138986,0.012398515712287072,0.027670666133224654,2.801568319439979e-09,158.25
94,0.9700525628478953,0.956401119861977,0.4441572424427899,0.7071049026453426,3086.8619760002907,3160.904813042297,4.049060047655321e-05,7.866978188531565e-05,0.0005561630257681613,1.6036479969826643e-05,0.011944356906968918,0.017311652355596254,6.800143968267441e-08,4.6115093783980227e-17,0.0020263604391133672,0.0012299046213895674,0.000381257608138986,0.011378176900813922,0.02858317775919975,2.8093673996681275e-09,166.62
95,0.9695845098243087,0.956721707915236,0.3859538280875417,0.6777691689559252,2988.468802000303,3457.991417976435,3.481672739049929e-05,6.77663052152523e-05,0.0004714518452028816,1.6036479969826643e-05,0.013066981171695706,0.016758369850740133,6.7795476973153e-08,3.965307083538772e-17,0.001745510877267359,0.0010425734475548755,0.000381257608138986,0.012447587131661506,0.027661360219282855,2.800858389794558e-09,157.89
96,0.9696129396135693,0.9570580031743008,0.37922930095353735,0.6744211202835533,2956.1270310002988,3505.3258588514295,3.261935595855745e-05,6.313917784697031e-05,0.00046141497546765885,1.6036479969826643e-05,0.013245847505623244,0.01656793524358169,6.764798282356369e-08,3.7150465577139833e-17,0.001626326259983254,0.0010203778108446037,0.000381257608138986,0.012617974939467223,0.027296057412500227,2.7947649121059743e-09,156.88
97,0.9696580554731862,0.9571992663876884,0.37819128857825673,0.6739246720257215,2939.463043000304,3518.307368167298,3.1476717379281455e-05,6.067137658388658e-05,0.00045966856013373013,1.6036479969826643e-05,0.01329490174471963,0.016479122033337606,6.761468991952573e-08,3.584910465326271e-17,0.0015627611307650643,0.0010165157700570168,0.000381257608138986,0.012664703935805889,0.027175492374155244,2.7933894706494252e-09,156.73
98,0.9695163385217165,0.9568871463800618,0.3781972524118288,0.6738567954667727,2963.9255800003025,3517.4474788930975,3.2551286763763486e-05,6.300992847914122e-05,0.0004603109197967844,1.6036479969826643e-05,0.013291652414227554,0.016620032777594086,6.767145225529907e-08,3.707294098464726e-17,0.0016229970807295085,0.0010179362908064738,0.000381257608138986,0.012661608628336766,0.027429051216191918,2.7957345129955104e-09,156.73
99,0.9698265918882956,0.9566210234524294,0.40096581010989973,0.6853962009990977,3017.076513000301,3342.2059073924374,3.831945130927252e-05,7.503701298686562e-05,0.0004933723687046079,1.6036479969826643e-05,0.01262945345578207,0.01692112123907474,6.8103877021985e-08,4.364235328890811e-17,0.0019327883075547477,0.0010910487181301086,0.000381257608138986,0.012030798870104296,0.027943080230042976,2.813599429503243e-09,160.15
