"ID","CPF","NOME","EMAIL","ESTADO_CIVIL"
"1","911.660.770-80","Lara Moura Souza","lara.souza@localhost.com","Solteiro(a)"
"2","230.326.180-53","Bianca Rocha Dias","bianca.dias@localhost.com","Viúvo(a)"
"3","960.183.650-06","Lívia Oliveira Cardoso","livia.cardoso@localhost.com","Casado(a)"
"4","260.658.870-30","Beatriz Barros Gomes","beatriz.gomes@localhost.com","Casado(a)"
"5","927.027.290-70","Itamar Franco","itamar.franco@localhost.com","Casado(a)"
"6","268.552.470-32","Regina Alvez Prado","regina.prado@localhost.com","Viúvo(a)"
"7","797.423.600-06","Catarina Martins Martins","catarina.martins@localhost.com","Solteiro(a)"
"8","368.942.710-03","Steve Magal","steve.magal@localhost.com","Solteiro(a)"
"9","600.361.190-16","Sidney Seagal","sidney.seagal@localhost.com","Casado(a)"
"10","256.273.220-04","Ana Catarina","ana.catarina@localhost.com","Solteiro(a)"
"11","488.273.280-76","Dona Danuza","dona.danuza@localhost.com","Casado(a)"
"12","678.964.500-46","Seu Edson","seu.edson@localhost.com","Casado(a)"
"13","062.959.670-00","Vovó Juju","vovo.juju@localhost.com","Viúvo(a)"
"14","605.910.210-72","Vovó Gigi","vovo.gigi@localhost.com","Viúvo(a)"
"15","928.381.540-87","Vicente Van Gogh","vicente.gogh@localhost.com","Solteiro(a)"
"16","110.037.790-50","Gil Brother","gil.brother@localhost.com","Viúvo(a)"
"17","980.632.960-01","Rebeca Lima Gomes","rebeca.gomes@localhost.com","Solteiro(a)"
"18","114.947.980-93","Irmão do Jorel","irmao.jorel@localhost.com","Solteiro(a)"
"19","042.595.660-16","James Hetfield","james.hetfield@localhost.com","Casado(a)"
"20","336.570.710-75","Pedro Paulo Soares Pereira","pedro.pereira@localhost.com","Casado(a)"