﻿date,exchange,gold
20221031,31.815,1689
20221028,31.75,1697
20221027,31.685,1701
20221026,31.82,1714
20221025,31.925,1700
20221024,31.835,1702
20221021,31.795,1665
20221020,31.71,1668
20221019,31.625,1675
20221018,31.6,1689
20221017,31.6,1689
20221014,31.495,1698
20221013,31.495,1697
20221012,31.445,1697
20221011,31.455,1695
20221007,31.27,1728
20221006,31.125,1731
20221005,31.17,1734
20221004,31.35,1729
20221003,31.475,1691
