<class>
	<keyword>class</keyword>
	<identifier>Sys</identifier>
	<symbol>{</symbol>
	<subroutineDec>
		<keyword>function</keyword>
		<keyword>void</keyword>
		<identifier>init</identifier>
		<symbol>(</symbol>
		<parameterList>
</parameterList>
		<symbol>)</symbol>
		<subroutineBody>
			<symbol>{</symbol>
			<statements>
				<doStatement>
					<keyword>do</keyword>
					<identifier>Memory</identifier>
					<symbol>.</symbol>
					<identifier>init</identifier>
					<symbol>(</symbol>
					<expressionList>
</expressionList>
					<symbol>)</symbol>
					<symbol>;</symbol>
				</doStatement>
				<doStatement>
					<keyword>do</keyword>
					<identifier>Math</identifier>
					<symbol>.</symbol>
					<identifier>init</identifier>
					<symbol>(</symbol>
					<expressionList>
</expressionList>
					<symbol>)</symbol>
					<symbol>;</symbol>
				</doStatement>
				<doStatement>
					<keyword>do</keyword>
					<identifier>Screen</identifier>
					<symbol>.</symbol>
					<identifier>init</identifier>
					<symbol>(</symbol>
					<expressionList>
</expressionList>
					<symbol>)</symbol>
					<symbol>;</symbol>
				</doStatement>
				<doStatement>
					<keyword>do</keyword>
					<identifier>Output</identifier>
					<symbol>.</symbol>
					<identifier>init</identifier>
					<symbol>(</symbol>
					<expressionList>
</expressionList>
					<symbol>)</symbol>
					<symbol>;</symbol>
				</doStatement>
				<doStatement>
					<keyword>do</keyword>
					<identifier>Keyboard</identifier>
					<symbol>.</symbol>
					<identifier>init</identifier>
					<symbol>(</symbol>
					<expressionList>
</expressionList>
					<symbol>)</symbol>
					<symbol>;</symbol>
				</doStatement>
				<doStatement>
					<keyword>do</keyword>
					<identifier>Main</identifier>
					<symbol>.</symbol>
					<identifier>main</identifier>
					<symbol>(</symbol>
					<expressionList>
</expressionList>
					<symbol>)</symbol>
					<symbol>;</symbol>
				</doStatement>
				<doStatement>
					<keyword>do</keyword>
					<identifier>Sys</identifier>
					<symbol>.</symbol>
					<identifier>halt</identifier>
					<symbol>(</symbol>
					<expressionList>
</expressionList>
					<symbol>)</symbol>
					<symbol>;</symbol>
				</doStatement>
				<returnStatement>
					<keyword>return</keyword>
					<symbol>;</symbol>
				</returnStatement>
			</statements>
			<symbol>}</symbol>
		</subroutineBody>
	</subroutineDec>
	<subroutineDec>
		<keyword>function</keyword>
		<keyword>void</keyword>
		<identifier>halt</identifier>
		<symbol>(</symbol>
		<parameterList>
</parameterList>
		<symbol>)</symbol>
		<subroutineBody>
			<symbol>{</symbol>
			<statements>
				<whileStatement>
					<keyword>while</keyword>
					<symbol>(</symbol>
					<expression>
						<term>
							<keyword>true</keyword>
						</term>
					</expression>
					<symbol>)</symbol>
					<symbol>{</symbol>
					<statements>
</statements>
					<symbol>}</symbol>
				</whileStatement>
				<returnStatement>
					<keyword>return</keyword>
					<symbol>;</symbol>
				</returnStatement>
			</statements>
			<symbol>}</symbol>
		</subroutineBody>
	</subroutineDec>
	<subroutineDec>
		<keyword>function</keyword>
		<keyword>void</keyword>
		<identifier>waitMillisecond</identifier>
		<symbol>(</symbol>
		<parameterList>
</parameterList>
		<symbol>)</symbol>
		<subroutineBody>
			<symbol>{</symbol>
			<varDec>
				<keyword>var</keyword>
				<keyword>int</keyword>
				<identifier>i</identifier>
				<symbol>;</symbol>
			</varDec>
			<statements>
				<whileStatement>
					<keyword>while</keyword>
					<symbol>(</symbol>
					<expression>
						<term>
							<identifier>i</identifier>
						</term>
						<symbol>&lt;</symbol>
						<term>
							<integerConstant>67</integerConstant>
						</term>
					</expression>
					<symbol>)</symbol>
					<symbol>{</symbol>
					<statements>
						<letStatement>
							<keyword>let</keyword>
							<identifier>i</identifier>
							<symbol>=</symbol>
							<expression>
								<term>
									<identifier>i</identifier>
								</term>
								<symbol>+</symbol>
								<term>
									<integerConstant>1</integerConstant>
								</term>
							</expression>
							<symbol>;</symbol>
						</letStatement>
					</statements>
					<symbol>}</symbol>
				</whileStatement>
				<returnStatement>
					<keyword>return</keyword>
					<symbol>;</symbol>
				</returnStatement>
			</statements>
			<symbol>}</symbol>
		</subroutineBody>
	</subroutineDec>
	<subroutineDec>
		<keyword>function</keyword>
		<keyword>void</keyword>
		<identifier>wait</identifier>
		<symbol>(</symbol>
		<parameterList>
			<keyword>int</keyword>
			<identifier>duration</identifier>
		</parameterList>
		<symbol>)</symbol>
		<subroutineBody>
			<symbol>{</symbol>
			<varDec>
				<keyword>var</keyword>
				<keyword>int</keyword>
				<identifier>i</identifier>
				<symbol>;</symbol>
			</varDec>
			<statements>
				<whileStatement>
					<keyword>while</keyword>
					<symbol>(</symbol>
					<expression>
						<term>
							<identifier>i</identifier>
						</term>
						<symbol>&lt;</symbol>
						<term>
							<identifier>duration</identifier>
						</term>
					</expression>
					<symbol>)</symbol>
					<symbol>{</symbol>
					<statements>
						<doStatement>
							<keyword>do</keyword>
							<identifier>Sys</identifier>
							<symbol>.</symbol>
							<identifier>waitMillisecond</identifier>
							<symbol>(</symbol>
							<expressionList>
</expressionList>
							<symbol>)</symbol>
							<symbol>;</symbol>
						</doStatement>
						<letStatement>
							<keyword>let</keyword>
							<identifier>i</identifier>
							<symbol>=</symbol>
							<expression>
								<term>
									<identifier>i</identifier>
								</term>
								<symbol>+</symbol>
								<term>
									<integerConstant>1</integerConstant>
								</term>
							</expression>
							<symbol>;</symbol>
						</letStatement>
					</statements>
					<symbol>}</symbol>
				</whileStatement>
				<returnStatement>
					<keyword>return</keyword>
					<symbol>;</symbol>
				</returnStatement>
			</statements>
			<symbol>}</symbol>
		</subroutineBody>
	</subroutineDec>
	<subroutineDec>
		<keyword>function</keyword>
		<keyword>void</keyword>
		<identifier>error</identifier>
		<symbol>(</symbol>
		<parameterList>
			<keyword>int</keyword>
			<identifier>errorCode</identifier>
		</parameterList>
		<symbol>)</symbol>
		<subroutineBody>
			<symbol>{</symbol>
			<statements>
				<doStatement>
					<keyword>do</keyword>
					<identifier>Output</identifier>
					<symbol>.</symbol>
					<identifier>printString</identifier>
					<symbol>(</symbol>
					<expressionList>
						<expression>
							<term>
								<stringConstant>ERR</stringConstant>
							</term>
						</expression>
					</expressionList>
					<symbol>)</symbol>
					<symbol>;</symbol>
				</doStatement>
				<doStatement>
					<keyword>do</keyword>
					<identifier>Output</identifier>
					<symbol>.</symbol>
					<identifier>printInt</identifier>
					<symbol>(</symbol>
					<expressionList>
						<expression>
							<term>
								<identifier>errorCode</identifier>
							</term>
						</expression>
					</expressionList>
					<symbol>)</symbol>
					<symbol>;</symbol>
				</doStatement>
				<doStatement>
					<keyword>do</keyword>
					<identifier>Sys</identifier>
					<symbol>.</symbol>
					<identifier>halt</identifier>
					<symbol>(</symbol>
					<expressionList>
</expressionList>
					<symbol>)</symbol>
					<symbol>;</symbol>
				</doStatement>
				<returnStatement>
					<keyword>return</keyword>
					<symbol>;</symbol>
				</returnStatement>
			</statements>
			<symbol>}</symbol>
		</subroutineBody>
	</subroutineDec>
	<symbol>}</symbol>
</class>
