<tokens>
	<keyword>class</keyword>
	<identifier>TabIssue</identifier>
	<symbol>{</symbol>
	<keyword>field</keyword>
	<identifier>String</identifier>
	<identifier>a</identifier>
	<symbol>,</symbol>
	<identifier>x</identifier>
	<symbol>,</symbol>
	<identifier>y</identifier>
	<symbol>,</symbol>
	<identifier>z</identifier>
	<symbol>,</symbol>
	<identifier>w</identifier>
	<symbol>,</symbol>
	<identifier>u</identifier>
	<symbol>,</symbol>
	<identifier>catchy</identifier>
	<symbol>;</symbol>
	<keyword>field</keyword>
	<keyword>int</keyword>
	<identifier>catchy2</identifier>
	<symbol>;</symbol>
	<keyword>constructor</keyword>
	<identifier>SquareGame</identifier>
	<identifier>new</identifier>
	<symbol>(</symbol>
	<symbol>)</symbol>
	<symbol>{</symbol>
	<keyword>let</keyword>
	<identifier>x</identifier>
	<symbol>=</symbol>
	<stringConstant>yo man</stringConstant>
	<symbol>;</symbol>
	<keyword>let</keyword>
	<identifier>y</identifier>
	<symbol>=</symbol>
	<stringConstant/>
	<symbol>;</symbol>
	<keyword>let</keyword>
	<identifier>z</identifier>
	<symbol>=</symbol>
	<stringConstant>\t</stringConstant>
	<symbol>;</symbol>
	<keyword>let</keyword>
	<identifier>u</identifier>
	<symbol>=</symbol>
	<stringConstant>\n</stringConstant>
	<symbol>;</symbol>
	<keyword>let</keyword>
	<identifier>w</identifier>
	<symbol>=</symbol>
	<stringConstant>\tyoman\n</stringConstant>
	<symbol>;</symbol>
	<keyword>let</keyword>
	<identifier>a</identifier>
	<symbol>=</symbol>
	<stringConstant>text //</stringConstant>
	<symbol>;</symbol>
	<keyword>let</keyword>
	<identifier>catchy</identifier>
	<symbol>=</symbol>
	<stringConstant>/*bla//a*/qqq</stringConstant>
	<symbol>;</symbol>
	<keyword>let</keyword>
	<identifier>catchy2</identifier>
	<symbol>=</symbol>
	<integerConstant>9765</integerConstant>
	<symbol>;</symbol>
	<keyword>let</keyword>
	<identifier>z</identifier>
	<symbol>=</symbol>
	<stringConstant>seeyounow</stringConstant>
	<symbol>;</symbol>
	<keyword>let</keyword>
	<identifier>a</identifier>
	<symbol>=</symbol>
	<stringConstant>another one</stringConstant>
	<symbol>;</symbol>
	<keyword>let</keyword>
	<identifier>a</identifier>
	<symbol>=</symbol>
	<stringConstant>anotheranother</stringConstant>
	<symbol>;</symbol>
	<symbol>}</symbol>
	<keyword>method</keyword>
	<keyword>void</keyword>
	<identifier>dispose</identifier>
	<symbol>(</symbol>
	<symbol>)</symbol>
	<symbol>{</symbol>
	<symbol>}</symbol>
	<keyword>method</keyword>
	<keyword>void</keyword>
	<identifier>try</identifier>
	<symbol>(</symbol>
	<symbol>)</symbol>
	<symbol>{</symbol>
	<keyword>while</keyword>
	<symbol>(</symbol>
	<identifier>i</identifier>
	<symbol>&lt;</symbol>
	<integerConstant>10</integerConstant>
	<symbol>)</symbol>
	<symbol>{</symbol>
	<symbol>}</symbol>
	<keyword>if</keyword>
	<symbol>(</symbol>
	<identifier>catchy</identifier>
	<symbol>&gt;</symbol>
	<integerConstant>100</integerConstant>
	<symbol>)</symbol>
	<symbol>{</symbol>
	<symbol>}</symbol>
	<keyword>else</keyword>
	<symbol>{</symbol>
	<symbol>}</symbol>
	<symbol>}</symbol>
	<symbol>}</symbol>
</tokens>
