<class>
	<keyword>class</keyword>
	<identifier>Board</identifier>
	<symbol>{</symbol>
	<classVarDec>
		<keyword>field</keyword>
		<identifier>Array</identifier>
		<identifier>boardArray</identifier>
		<symbol>;</symbol>
	</classVarDec>
	<classVarDec>
		<keyword>field</keyword>
		<keyword>int</keyword>
		<identifier>boardX</identifier>
		<symbol>,</symbol>
		<identifier>boardY</identifier>
		<symbol>,</symbol>
		<identifier>boardSize</identifier>
		<symbol>,</symbol>
		<identifier>thickness</identifier>
		<symbol>,</symbol>
		<identifier>cellSize</identifier>
		<symbol>;</symbol>
	</classVarDec>
	<classVarDec>
		<keyword>field</keyword>
		<keyword>int</keyword>
		<identifier>winThickness</identifier>
		<symbol>;</symbol>
	</classVarDec>
	<classVarDec>
		<keyword>field</keyword>
		<keyword>boolean</keyword>
		<identifier>isWin</identifier>
		<symbol>,</symbol>
		<identifier>isDraw</identifier>
		<symbol>;</symbol>
	</classVarDec>
	<classVarDec>
		<keyword>field</keyword>
		<keyword>int</keyword>
		<identifier>winMode</identifier>
		<symbol>;</symbol>
	</classVarDec>
	<classVarDec>
		<keyword>field</keyword>
		<keyword>int</keyword>
		<identifier>winRow</identifier>
		<symbol>,</symbol>
		<identifier>winCol</identifier>
		<symbol>;</symbol>
	</classVarDec>
	<classVarDec>
		<keyword>field</keyword>
		<keyword>int</keyword>
		<identifier>freeCellCount</identifier>
		<symbol>;</symbol>
	</classVarDec>
	<subroutineDec>
		<keyword>constructor</keyword>
		<identifier>Board</identifier>
		<identifier>new</identifier>
		<symbol>(</symbol>
		<parameterList>
			<keyword>int</keyword>
			<identifier>x</identifier>
			<symbol>,</symbol>
			<keyword>int</keyword>
			<identifier>y</identifier>
		</parameterList>
		<symbol>)</symbol>
		<subroutineBody>
			<symbol>{</symbol>
			<statements>
				<letStatement>
					<keyword>let</keyword>
					<identifier>boardX</identifier>
					<symbol>=</symbol>
					<expression>
						<term>
							<identifier>x</identifier>
						</term>
					</expression>
					<symbol>;</symbol>
				</letStatement>
				<letStatement>
					<keyword>let</keyword>
					<identifier>boardY</identifier>
					<symbol>=</symbol>
					<expression>
						<term>
							<identifier>y</identifier>
						</term>
					</expression>
					<symbol>;</symbol>
				</letStatement>
				<letStatement>
					<keyword>let</keyword>
					<identifier>boardSize</identifier>
					<symbol>=</symbol>
					<expression>
						<term>
							<integerConstant>120</integerConstant>
						</term>
					</expression>
					<symbol>;</symbol>
				</letStatement>
				<letStatement>
					<keyword>let</keyword>
					<identifier>thickness</identifier>
					<symbol>=</symbol>
					<expression>
						<term>
							<integerConstant>4</integerConstant>
						</term>
					</expression>
					<symbol>;</symbol>
				</letStatement>
				<letStatement>
					<keyword>let</keyword>
					<identifier>winThickness</identifier>
					<symbol>=</symbol>
					<expression>
						<term>
							<integerConstant>4</integerConstant>
						</term>
					</expression>
					<symbol>;</symbol>
				</letStatement>
				<letStatement>
					<keyword>let</keyword>
					<identifier>cellSize</identifier>
					<symbol>=</symbol>
					<expression>
						<term>
							<identifier>boardSize</identifier>
						</term>
						<symbol>/</symbol>
						<term>
							<integerConstant>3</integerConstant>
						</term>
					</expression>
					<symbol>;</symbol>
				</letStatement>
				<letStatement>
					<keyword>let</keyword>
					<identifier>boardArray</identifier>
					<symbol>=</symbol>
					<expression>
						<term>
							<identifier>Array</identifier>
							<symbol>.</symbol>
							<identifier>new</identifier>
							<symbol>(</symbol>
							<expressionList>
								<expression>
									<term>
										<integerConstant>9</integerConstant>
									</term>
								</expression>
							</expressionList>
							<symbol>)</symbol>
						</term>
					</expression>
					<symbol>;</symbol>
				</letStatement>
				<doStatement>
					<keyword>do</keyword>
					<identifier>clearBoard</identifier>
					<symbol>(</symbol>
					<expressionList>
</expressionList>
					<symbol>)</symbol>
					<symbol>;</symbol>
				</doStatement>
				<doStatement>
					<keyword>do</keyword>
					<identifier>drawBoardBorders</identifier>
					<symbol>(</symbol>
					<expressionList>
</expressionList>
					<symbol>)</symbol>
					<symbol>;</symbol>
				</doStatement>
				<returnStatement>
					<keyword>return</keyword>
					<expression>
						<term>
							<keyword>this</keyword>
						</term>
					</expression>
					<symbol>;</symbol>
				</returnStatement>
			</statements>
			<symbol>}</symbol>
		</subroutineBody>
	</subroutineDec>
	<subroutineDec>
		<keyword>method</keyword>
		<keyword>void</keyword>
		<identifier>dispose</identifier>
		<symbol>(</symbol>
		<parameterList>
</parameterList>
		<symbol>)</symbol>
		<subroutineBody>
			<symbol>{</symbol>
			<statements>
				<doStatement>
					<keyword>do</keyword>
					<identifier>Screen</identifier>
					<symbol>.</symbol>
					<identifier>setColor</identifier>
					<symbol>(</symbol>
					<expressionList>
						<expression>
							<term>
								<keyword>false</keyword>
							</term>
						</expression>
					</expressionList>
					<symbol>)</symbol>
					<symbol>;</symbol>
				</doStatement>
				<doStatement>
					<keyword>do</keyword>
					<identifier>Screen</identifier>
					<symbol>.</symbol>
					<identifier>drawRectangle</identifier>
					<symbol>(</symbol>
					<expressionList>
						<expression>
							<term>
								<identifier>boardX</identifier>
							</term>
						</expression>
						<symbol>,</symbol>
						<expression>
							<term>
								<identifier>boardY</identifier>
							</term>
						</expression>
						<symbol>,</symbol>
						<expression>
							<term>
								<identifier>boardX</identifier>
							</term>
							<symbol>+</symbol>
							<term>
								<identifier>boardSize</identifier>
							</term>
						</expression>
						<symbol>,</symbol>
						<expression>
							<term>
								<identifier>boardY</identifier>
							</term>
							<symbol>+</symbol>
							<term>
								<identifier>boardSize</identifier>
							</term>
						</expression>
					</expressionList>
					<symbol>)</symbol>
					<symbol>;</symbol>
				</doStatement>
				<doStatement>
					<keyword>do</keyword>
					<identifier>Screen</identifier>
					<symbol>.</symbol>
					<identifier>setColor</identifier>
					<symbol>(</symbol>
					<expressionList>
						<expression>
							<term>
								<keyword>true</keyword>
							</term>
						</expression>
					</expressionList>
					<symbol>)</symbol>
					<symbol>;</symbol>
				</doStatement>
				<doStatement>
					<keyword>do</keyword>
					<identifier>Memory</identifier>
					<symbol>.</symbol>
					<identifier>deAlloc</identifier>
					<symbol>(</symbol>
					<expressionList>
						<expression>
							<term>
								<identifier>boardArray</identifier>
							</term>
						</expression>
					</expressionList>
					<symbol>)</symbol>
					<symbol>;</symbol>
				</doStatement>
				<returnStatement>
					<keyword>return</keyword>
					<symbol>;</symbol>
				</returnStatement>
			</statements>
			<symbol>}</symbol>
		</subroutineBody>
	</subroutineDec>
	<subroutineDec>
		<keyword>method</keyword>
		<keyword>void</keyword>
		<identifier>clearBoard</identifier>
		<symbol>(</symbol>
		<parameterList>
</parameterList>
		<symbol>)</symbol>
		<subroutineBody>
			<symbol>{</symbol>
			<varDec>
				<keyword>var</keyword>
				<keyword>int</keyword>
				<identifier>i</identifier>
				<symbol>;</symbol>
			</varDec>
			<statements>
				<letStatement>
					<keyword>let</keyword>
					<identifier>freeCellCount</identifier>
					<symbol>=</symbol>
					<expression>
						<term>
							<integerConstant>9</integerConstant>
						</term>
					</expression>
					<symbol>;</symbol>
				</letStatement>
				<letStatement>
					<keyword>let</keyword>
					<identifier>isWin</identifier>
					<symbol>=</symbol>
					<expression>
						<term>
							<keyword>false</keyword>
						</term>
					</expression>
					<symbol>;</symbol>
				</letStatement>
				<letStatement>
					<keyword>let</keyword>
					<identifier>isDraw</identifier>
					<symbol>=</symbol>
					<expression>
						<term>
							<keyword>false</keyword>
						</term>
					</expression>
					<symbol>;</symbol>
				</letStatement>
				<whileStatement>
					<keyword>while</keyword>
					<symbol>(</symbol>
					<expression>
						<term>
							<identifier>i</identifier>
						</term>
						<symbol>&lt;</symbol>
						<term>
							<integerConstant>9</integerConstant>
						</term>
					</expression>
					<symbol>)</symbol>
					<symbol>{</symbol>
					<statements>
						<letStatement>
							<keyword>let</keyword>
							<identifier>boardArray</identifier>
							<symbol>[</symbol>
							<expression>
								<term>
									<identifier>i</identifier>
								</term>
							</expression>
							<symbol>]</symbol>
							<symbol>=</symbol>
							<expression>
								<term>
									<integerConstant>0</integerConstant>
								</term>
							</expression>
							<symbol>;</symbol>
						</letStatement>
						<letStatement>
							<keyword>let</keyword>
							<identifier>i</identifier>
							<symbol>=</symbol>
							<expression>
								<term>
									<identifier>i</identifier>
								</term>
								<symbol>+</symbol>
								<term>
									<integerConstant>1</integerConstant>
								</term>
							</expression>
							<symbol>;</symbol>
						</letStatement>
					</statements>
					<symbol>}</symbol>
				</whileStatement>
				<returnStatement>
					<keyword>return</keyword>
					<symbol>;</symbol>
				</returnStatement>
			</statements>
			<symbol>}</symbol>
		</subroutineBody>
	</subroutineDec>
	<subroutineDec>
		<keyword>method</keyword>
		<keyword>int</keyword>
		<identifier>posToIndex</identifier>
		<symbol>(</symbol>
		<parameterList>
			<keyword>int</keyword>
			<identifier>row</identifier>
			<symbol>,</symbol>
			<keyword>int</keyword>
			<identifier>col</identifier>
		</parameterList>
		<symbol>)</symbol>
		<subroutineBody>
			<symbol>{</symbol>
			<statements>
				<returnStatement>
					<keyword>return</keyword>
					<expression>
						<term>
							<symbol>(</symbol>
							<expression>
								<term>
									<identifier>row</identifier>
								</term>
								<symbol>*</symbol>
								<term>
									<integerConstant>3</integerConstant>
								</term>
							</expression>
							<symbol>)</symbol>
						</term>
						<symbol>+</symbol>
						<term>
							<identifier>col</identifier>
						</term>
					</expression>
					<symbol>;</symbol>
				</returnStatement>
			</statements>
			<symbol>}</symbol>
		</subroutineBody>
	</subroutineDec>
	<subroutineDec>
		<keyword>method</keyword>
		<keyword>boolean</keyword>
		<identifier>isFree</identifier>
		<symbol>(</symbol>
		<parameterList>
			<keyword>int</keyword>
			<identifier>row</identifier>
			<symbol>,</symbol>
			<keyword>int</keyword>
			<identifier>col</identifier>
		</parameterList>
		<symbol>)</symbol>
		<subroutineBody>
			<symbol>{</symbol>
			<statements>
				<ifStatement>
					<keyword>if</keyword>
					<symbol>(</symbol>
					<expression>
						<term>
							<identifier>boardArray</identifier>
							<symbol>[</symbol>
							<expression>
								<term>
									<identifier>posToIndex</identifier>
									<symbol>(</symbol>
									<expressionList>
										<expression>
											<term>
												<identifier>row</identifier>
											</term>
										</expression>
										<symbol>,</symbol>
										<expression>
											<term>
												<identifier>col</identifier>
											</term>
										</expression>
									</expressionList>
									<symbol>)</symbol>
								</term>
							</expression>
							<symbol>]</symbol>
						</term>
						<symbol>=</symbol>
						<term>
							<integerConstant>0</integerConstant>
						</term>
					</expression>
					<symbol>)</symbol>
					<symbol>{</symbol>
					<statements>
						<returnStatement>
							<keyword>return</keyword>
							<expression>
								<term>
									<keyword>true</keyword>
								</term>
							</expression>
							<symbol>;</symbol>
						</returnStatement>
					</statements>
					<symbol>}</symbol>
					<keyword>else</keyword>
					<symbol>{</symbol>
					<statements>
						<returnStatement>
							<keyword>return</keyword>
							<expression>
								<term>
									<keyword>false</keyword>
								</term>
							</expression>
							<symbol>;</symbol>
						</returnStatement>
					</statements>
					<symbol>}</symbol>
				</ifStatement>
			</statements>
			<symbol>}</symbol>
		</subroutineBody>
	</subroutineDec>
	<subroutineDec>
		<keyword>method</keyword>
		<keyword>int</keyword>
		<identifier>rowToY</identifier>
		<symbol>(</symbol>
		<parameterList>
			<keyword>int</keyword>
			<identifier>r</identifier>
		</parameterList>
		<symbol>)</symbol>
		<subroutineBody>
			<symbol>{</symbol>
			<statements>
				<returnStatement>
					<keyword>return</keyword>
					<expression>
						<term>
							<identifier>boardY</identifier>
						</term>
						<symbol>+</symbol>
						<term>
							<symbol>(</symbol>
							<expression>
								<term>
									<identifier>r</identifier>
								</term>
								<symbol>*</symbol>
								<term>
									<identifier>cellSize</identifier>
								</term>
							</expression>
							<symbol>)</symbol>
						</term>
					</expression>
					<symbol>;</symbol>
				</returnStatement>
			</statements>
			<symbol>}</symbol>
		</subroutineBody>
	</subroutineDec>
	<subroutineDec>
		<keyword>method</keyword>
		<keyword>int</keyword>
		<identifier>colToX</identifier>
		<symbol>(</symbol>
		<parameterList>
			<keyword>int</keyword>
			<identifier>c</identifier>
		</parameterList>
		<symbol>)</symbol>
		<subroutineBody>
			<symbol>{</symbol>
			<statements>
				<returnStatement>
					<keyword>return</keyword>
					<expression>
						<term>
							<identifier>boardX</identifier>
						</term>
						<symbol>+</symbol>
						<term>
							<symbol>(</symbol>
							<expression>
								<term>
									<identifier>c</identifier>
								</term>
								<symbol>*</symbol>
								<term>
									<identifier>cellSize</identifier>
								</term>
							</expression>
							<symbol>)</symbol>
						</term>
					</expression>
					<symbol>;</symbol>
				</returnStatement>
			</statements>
			<symbol>}</symbol>
		</subroutineBody>
	</subroutineDec>
	<subroutineDec>
		<keyword>method</keyword>
		<keyword>void</keyword>
		<identifier>drawBoardBorders</identifier>
		<symbol>(</symbol>
		<parameterList>
</parameterList>
		<symbol>)</symbol>
		<subroutineBody>
			<symbol>{</symbol>
			<varDec>
				<keyword>var</keyword>
				<keyword>int</keyword>
				<identifier>offset</identifier>
				<symbol>;</symbol>
			</varDec>
			<statements>
				<letStatement>
					<keyword>let</keyword>
					<identifier>offset</identifier>
					<symbol>=</symbol>
					<expression>
						<term>
							<identifier>thickness</identifier>
						</term>
						<symbol>/</symbol>
						<term>
							<integerConstant>2</integerConstant>
						</term>
					</expression>
					<symbol>;</symbol>
				</letStatement>
				<doStatement>
					<keyword>do</keyword>
					<identifier>Screen</identifier>
					<symbol>.</symbol>
					<identifier>drawRectangle</identifier>
					<symbol>(</symbol>
					<expressionList>
						<expression>
							<term>
								<identifier>boardX</identifier>
							</term>
							<symbol>+</symbol>
							<term>
								<identifier>cellSize</identifier>
							</term>
							<symbol>-</symbol>
							<term>
								<identifier>offset</identifier>
							</term>
						</expression>
						<symbol>,</symbol>
						<expression>
							<term>
								<identifier>boardY</identifier>
							</term>
						</expression>
						<symbol>,</symbol>
						<expression>
							<term>
								<identifier>boardX</identifier>
							</term>
							<symbol>+</symbol>
							<term>
								<identifier>cellSize</identifier>
							</term>
							<symbol>+</symbol>
							<term>
								<identifier>offset</identifier>
							</term>
						</expression>
						<symbol>,</symbol>
						<expression>
							<term>
								<identifier>boardY</identifier>
							</term>
							<symbol>+</symbol>
							<term>
								<identifier>boardSize</identifier>
							</term>
						</expression>
					</expressionList>
					<symbol>)</symbol>
					<symbol>;</symbol>
				</doStatement>
				<doStatement>
					<keyword>do</keyword>
					<identifier>Screen</identifier>
					<symbol>.</symbol>
					<identifier>drawRectangle</identifier>
					<symbol>(</symbol>
					<expressionList>
						<expression>
							<term>
								<identifier>boardX</identifier>
							</term>
							<symbol>+</symbol>
							<term>
								<symbol>(</symbol>
								<expression>
									<term>
										<integerConstant>2</integerConstant>
									</term>
									<symbol>*</symbol>
									<term>
										<identifier>cellSize</identifier>
									</term>
								</expression>
								<symbol>)</symbol>
							</term>
							<symbol>-</symbol>
							<term>
								<identifier>offset</identifier>
							</term>
						</expression>
						<symbol>,</symbol>
						<expression>
							<term>
								<identifier>boardY</identifier>
							</term>
						</expression>
						<symbol>,</symbol>
						<expression>
							<term>
								<identifier>boardX</identifier>
							</term>
							<symbol>+</symbol>
							<term>
								<symbol>(</symbol>
								<expression>
									<term>
										<integerConstant>2</integerConstant>
									</term>
									<symbol>*</symbol>
									<term>
										<identifier>cellSize</identifier>
									</term>
								</expression>
								<symbol>)</symbol>
							</term>
							<symbol>+</symbol>
							<term>
								<identifier>offset</identifier>
							</term>
						</expression>
						<symbol>,</symbol>
						<expression>
							<term>
								<identifier>boardY</identifier>
							</term>
							<symbol>+</symbol>
							<term>
								<identifier>boardSize</identifier>
							</term>
						</expression>
					</expressionList>
					<symbol>)</symbol>
					<symbol>;</symbol>
				</doStatement>
				<doStatement>
					<keyword>do</keyword>
					<identifier>Screen</identifier>
					<symbol>.</symbol>
					<identifier>drawRectangle</identifier>
					<symbol>(</symbol>
					<expressionList>
						<expression>
							<term>
								<identifier>boardX</identifier>
							</term>
						</expression>
						<symbol>,</symbol>
						<expression>
							<term>
								<identifier>boardY</identifier>
							</term>
							<symbol>+</symbol>
							<term>
								<identifier>cellSize</identifier>
							</term>
							<symbol>-</symbol>
							<term>
								<identifier>offset</identifier>
							</term>
						</expression>
						<symbol>,</symbol>
						<expression>
							<term>
								<identifier>boardX</identifier>
							</term>
							<symbol>+</symbol>
							<term>
								<identifier>boardSize</identifier>
							</term>
						</expression>
						<symbol>,</symbol>
						<expression>
							<term>
								<identifier>boardY</identifier>
							</term>
							<symbol>+</symbol>
							<term>
								<identifier>cellSize</identifier>
							</term>
							<symbol>+</symbol>
							<term>
								<identifier>offset</identifier>
							</term>
						</expression>
					</expressionList>
					<symbol>)</symbol>
					<symbol>;</symbol>
				</doStatement>
				<doStatement>
					<keyword>do</keyword>
					<identifier>Screen</identifier>
					<symbol>.</symbol>
					<identifier>drawRectangle</identifier>
					<symbol>(</symbol>
					<expressionList>
						<expression>
							<term>
								<identifier>boardX</identifier>
							</term>
						</expression>
						<symbol>,</symbol>
						<expression>
							<term>
								<identifier>boardY</identifier>
							</term>
							<symbol>+</symbol>
							<term>
								<symbol>(</symbol>
								<expression>
									<term>
										<integerConstant>2</integerConstant>
									</term>
									<symbol>*</symbol>
									<term>
										<identifier>cellSize</identifier>
									</term>
								</expression>
								<symbol>)</symbol>
							</term>
							<symbol>-</symbol>
							<term>
								<identifier>offset</identifier>
							</term>
						</expression>
						<symbol>,</symbol>
						<expression>
							<term>
								<identifier>boardX</identifier>
							</term>
							<symbol>+</symbol>
							<term>
								<identifier>boardSize</identifier>
							</term>
						</expression>
						<symbol>,</symbol>
						<expression>
							<term>
								<identifier>boardY</identifier>
							</term>
							<symbol>+</symbol>
							<term>
								<symbol>(</symbol>
								<expression>
									<term>
										<integerConstant>2</integerConstant>
									</term>
									<symbol>*</symbol>
									<term>
										<identifier>cellSize</identifier>
									</term>
								</expression>
								<symbol>)</symbol>
							</term>
							<symbol>+</symbol>
							<term>
								<identifier>offset</identifier>
							</term>
						</expression>
					</expressionList>
					<symbol>)</symbol>
					<symbol>;</symbol>
				</doStatement>
				<returnStatement>
					<keyword>return</keyword>
					<symbol>;</symbol>
				</returnStatement>
			</statements>
			<symbol>}</symbol>
		</subroutineBody>
	</subroutineDec>
	<subroutineDec>
		<keyword>method</keyword>
		<keyword>void</keyword>
		<identifier>drawRowWin</identifier>
		<symbol>(</symbol>
		<parameterList>
			<keyword>int</keyword>
			<identifier>r</identifier>
		</parameterList>
		<symbol>)</symbol>
		<subroutineBody>
			<symbol>{</symbol>
			<varDec>
				<keyword>var</keyword>
				<keyword>int</keyword>
				<identifier>y</identifier>
				<symbol>,</symbol>
				<identifier>offset</identifier>
				<symbol>;</symbol>
			</varDec>
			<statements>
				<letStatement>
					<keyword>let</keyword>
					<identifier>y</identifier>
					<symbol>=</symbol>
					<expression>
						<term>
							<identifier>rowToY</identifier>
							<symbol>(</symbol>
							<expressionList>
								<expression>
									<term>
										<identifier>r</identifier>
									</term>
								</expression>
							</expressionList>
							<symbol>)</symbol>
						</term>
						<symbol>+</symbol>
						<term>
							<symbol>(</symbol>
							<expression>
								<term>
									<identifier>cellSize</identifier>
								</term>
								<symbol>/</symbol>
								<term>
									<integerConstant>2</integerConstant>
								</term>
							</expression>
							<symbol>)</symbol>
						</term>
					</expression>
					<symbol>;</symbol>
				</letStatement>
				<letStatement>
					<keyword>let</keyword>
					<identifier>offset</identifier>
					<symbol>=</symbol>
					<expression>
						<term>
							<identifier>winThickness</identifier>
						</term>
						<symbol>/</symbol>
						<term>
							<integerConstant>2</integerConstant>
						</term>
					</expression>
					<symbol>;</symbol>
				</letStatement>
				<doStatement>
					<keyword>do</keyword>
					<identifier>Screen</identifier>
					<symbol>.</symbol>
					<identifier>drawRectangle</identifier>
					<symbol>(</symbol>
					<expressionList>
						<expression>
							<term>
								<identifier>boardX</identifier>
							</term>
						</expression>
						<symbol>,</symbol>
						<expression>
							<term>
								<identifier>y</identifier>
							</term>
							<symbol>-</symbol>
							<term>
								<identifier>offset</identifier>
							</term>
						</expression>
						<symbol>,</symbol>
						<expression>
							<term>
								<identifier>boardX</identifier>
							</term>
							<symbol>+</symbol>
							<term>
								<identifier>boardSize</identifier>
							</term>
						</expression>
						<symbol>,</symbol>
						<expression>
							<term>
								<identifier>y</identifier>
							</term>
							<symbol>+</symbol>
							<term>
								<identifier>offset</identifier>
							</term>
						</expression>
					</expressionList>
					<symbol>)</symbol>
					<symbol>;</symbol>
				</doStatement>
				<returnStatement>
					<keyword>return</keyword>
					<symbol>;</symbol>
				</returnStatement>
			</statements>
			<symbol>}</symbol>
		</subroutineBody>
	</subroutineDec>
	<subroutineDec>
		<keyword>method</keyword>
		<keyword>void</keyword>
		<identifier>drawColWin</identifier>
		<symbol>(</symbol>
		<parameterList>
			<keyword>int</keyword>
			<identifier>c</identifier>
		</parameterList>
		<symbol>)</symbol>
		<subroutineBody>
			<symbol>{</symbol>
			<varDec>
				<keyword>var</keyword>
				<keyword>int</keyword>
				<identifier>x</identifier>
				<symbol>,</symbol>
				<identifier>offset</identifier>
				<symbol>;</symbol>
			</varDec>
			<statements>
				<letStatement>
					<keyword>let</keyword>
					<identifier>x</identifier>
					<symbol>=</symbol>
					<expression>
						<term>
							<identifier>colToX</identifier>
							<symbol>(</symbol>
							<expressionList>
								<expression>
									<term>
										<identifier>c</identifier>
									</term>
								</expression>
							</expressionList>
							<symbol>)</symbol>
						</term>
						<symbol>+</symbol>
						<term>
							<symbol>(</symbol>
							<expression>
								<term>
									<identifier>cellSize</identifier>
								</term>
								<symbol>/</symbol>
								<term>
									<integerConstant>2</integerConstant>
								</term>
							</expression>
							<symbol>)</symbol>
						</term>
					</expression>
					<symbol>;</symbol>
				</letStatement>
				<letStatement>
					<keyword>let</keyword>
					<identifier>offset</identifier>
					<symbol>=</symbol>
					<expression>
						<term>
							<identifier>winThickness</identifier>
						</term>
						<symbol>/</symbol>
						<term>
							<integerConstant>2</integerConstant>
						</term>
					</expression>
					<symbol>;</symbol>
				</letStatement>
				<doStatement>
					<keyword>do</keyword>
					<identifier>Screen</identifier>
					<symbol>.</symbol>
					<identifier>drawRectangle</identifier>
					<symbol>(</symbol>
					<expressionList>
						<expression>
							<term>
								<identifier>x</identifier>
							</term>
							<symbol>-</symbol>
							<term>
								<identifier>offset</identifier>
							</term>
						</expression>
						<symbol>,</symbol>
						<expression>
							<term>
								<identifier>boardY</identifier>
							</term>
						</expression>
						<symbol>,</symbol>
						<expression>
							<term>
								<identifier>x</identifier>
							</term>
							<symbol>+</symbol>
							<term>
								<identifier>offset</identifier>
							</term>
						</expression>
						<symbol>,</symbol>
						<expression>
							<term>
								<identifier>boardY</identifier>
							</term>
							<symbol>+</symbol>
							<term>
								<identifier>boardSize</identifier>
							</term>
						</expression>
					</expressionList>
					<symbol>)</symbol>
					<symbol>;</symbol>
				</doStatement>
				<returnStatement>
					<keyword>return</keyword>
					<symbol>;</symbol>
				</returnStatement>
			</statements>
			<symbol>}</symbol>
		</subroutineBody>
	</subroutineDec>
	<subroutineDec>
		<keyword>method</keyword>
		<keyword>void</keyword>
		<identifier>drawTopDiagonalWin</identifier>
		<symbol>(</symbol>
		<parameterList>
</parameterList>
		<symbol>)</symbol>
		<subroutineBody>
			<symbol>{</symbol>
			<varDec>
				<keyword>var</keyword>
				<keyword>int</keyword>
				<identifier>i</identifier>
				<symbol>,</symbol>
				<identifier>x</identifier>
				<symbol>,</symbol>
				<identifier>y</identifier>
				<symbol>;</symbol>
			</varDec>
			<statements>
				<letStatement>
					<keyword>let</keyword>
					<identifier>x</identifier>
					<symbol>=</symbol>
					<expression>
						<term>
							<identifier>boardX</identifier>
						</term>
					</expression>
					<symbol>;</symbol>
				</letStatement>
				<letStatement>
					<keyword>let</keyword>
					<identifier>y</identifier>
					<symbol>=</symbol>
					<expression>
						<term>
							<identifier>boardY</identifier>
						</term>
					</expression>
					<symbol>;</symbol>
				</letStatement>
				<letStatement>
					<keyword>let</keyword>
					<identifier>i</identifier>
					<symbol>=</symbol>
					<expression>
						<term>
							<identifier>winThickness</identifier>
						</term>
						<symbol>-</symbol>
						<term>
							<integerConstant>1</integerConstant>
						</term>
					</expression>
					<symbol>;</symbol>
				</letStatement>
				<whileStatement>
					<keyword>while</keyword>
					<symbol>(</symbol>
					<expression>
						<term>
							<symbol>~</symbol>
							<term>
								<symbol>(</symbol>
								<expression>
									<term>
										<identifier>i</identifier>
									</term>
									<symbol>&lt;</symbol>
									<term>
										<integerConstant>0</integerConstant>
									</term>
								</expression>
								<symbol>)</symbol>
							</term>
						</term>
					</expression>
					<symbol>)</symbol>
					<symbol>{</symbol>
					<statements>
						<doStatement>
							<keyword>do</keyword>
							<identifier>Screen</identifier>
							<symbol>.</symbol>
							<identifier>drawLine</identifier>
							<symbol>(</symbol>
							<expressionList>
								<expression>
									<term>
										<identifier>x</identifier>
									</term>
									<symbol>+</symbol>
									<term>
										<identifier>i</identifier>
									</term>
								</expression>
								<symbol>,</symbol>
								<expression>
									<term>
										<identifier>y</identifier>
									</term>
								</expression>
								<symbol>,</symbol>
								<expression>
									<term>
										<identifier>x</identifier>
									</term>
									<symbol>+</symbol>
									<term>
										<identifier>boardSize</identifier>
									</term>
								</expression>
								<symbol>,</symbol>
								<expression>
									<term>
										<identifier>y</identifier>
									</term>
									<symbol>+</symbol>
									<term>
										<identifier>boardSize</identifier>
									</term>
									<symbol>-</symbol>
									<term>
										<identifier>i</identifier>
									</term>
								</expression>
							</expressionList>
							<symbol>)</symbol>
							<symbol>;</symbol>
						</doStatement>
						<doStatement>
							<keyword>do</keyword>
							<identifier>Screen</identifier>
							<symbol>.</symbol>
							<identifier>drawLine</identifier>
							<symbol>(</symbol>
							<expressionList>
								<expression>
									<term>
										<identifier>x</identifier>
									</term>
								</expression>
								<symbol>,</symbol>
								<expression>
									<term>
										<identifier>y</identifier>
									</term>
									<symbol>+</symbol>
									<term>
										<identifier>i</identifier>
									</term>
								</expression>
								<symbol>,</symbol>
								<expression>
									<term>
										<identifier>x</identifier>
									</term>
									<symbol>+</symbol>
									<term>
										<identifier>boardSize</identifier>
									</term>
									<symbol>-</symbol>
									<term>
										<identifier>i</identifier>
									</term>
								</expression>
								<symbol>,</symbol>
								<expression>
									<term>
										<identifier>y</identifier>
									</term>
									<symbol>+</symbol>
									<term>
										<identifier>boardSize</identifier>
									</term>
								</expression>
							</expressionList>
							<symbol>)</symbol>
							<symbol>;</symbol>
						</doStatement>
						<letStatement>
							<keyword>let</keyword>
							<identifier>i</identifier>
							<symbol>=</symbol>
							<expression>
								<term>
									<identifier>i</identifier>
								</term>
								<symbol>-</symbol>
								<term>
									<integerConstant>1</integerConstant>
								</term>
							</expression>
							<symbol>;</symbol>
						</letStatement>
					</statements>
					<symbol>}</symbol>
				</whileStatement>
				<returnStatement>
					<keyword>return</keyword>
					<symbol>;</symbol>
				</returnStatement>
			</statements>
			<symbol>}</symbol>
		</subroutineBody>
	</subroutineDec>
	<subroutineDec>
		<keyword>method</keyword>
		<keyword>void</keyword>
		<identifier>drawBottomDiagonalWin</identifier>
		<symbol>(</symbol>
		<parameterList>
</parameterList>
		<symbol>)</symbol>
		<subroutineBody>
			<symbol>{</symbol>
			<varDec>
				<keyword>var</keyword>
				<keyword>int</keyword>
				<identifier>i</identifier>
				<symbol>,</symbol>
				<identifier>x</identifier>
				<symbol>,</symbol>
				<identifier>y</identifier>
				<symbol>;</symbol>
			</varDec>
			<statements>
				<letStatement>
					<keyword>let</keyword>
					<identifier>x</identifier>
					<symbol>=</symbol>
					<expression>
						<term>
							<identifier>boardX</identifier>
						</term>
					</expression>
					<symbol>;</symbol>
				</letStatement>
				<letStatement>
					<keyword>let</keyword>
					<identifier>y</identifier>
					<symbol>=</symbol>
					<expression>
						<term>
							<identifier>boardY</identifier>
						</term>
					</expression>
					<symbol>;</symbol>
				</letStatement>
				<letStatement>
					<keyword>let</keyword>
					<identifier>i</identifier>
					<symbol>=</symbol>
					<expression>
						<term>
							<identifier>winThickness</identifier>
						</term>
						<symbol>-</symbol>
						<term>
							<integerConstant>1</integerConstant>
						</term>
					</expression>
					<symbol>;</symbol>
				</letStatement>
				<whileStatement>
					<keyword>while</keyword>
					<symbol>(</symbol>
					<expression>
						<term>
							<symbol>~</symbol>
							<term>
								<symbol>(</symbol>
								<expression>
									<term>
										<identifier>i</identifier>
									</term>
									<symbol>&lt;</symbol>
									<term>
										<integerConstant>0</integerConstant>
									</term>
								</expression>
								<symbol>)</symbol>
							</term>
						</term>
					</expression>
					<symbol>)</symbol>
					<symbol>{</symbol>
					<statements>
						<doStatement>
							<keyword>do</keyword>
							<identifier>Screen</identifier>
							<symbol>.</symbol>
							<identifier>drawLine</identifier>
							<symbol>(</symbol>
							<expressionList>
								<expression>
									<term>
										<identifier>x</identifier>
									</term>
								</expression>
								<symbol>,</symbol>
								<expression>
									<term>
										<identifier>y</identifier>
									</term>
									<symbol>+</symbol>
									<term>
										<identifier>boardSize</identifier>
									</term>
									<symbol>-</symbol>
									<term>
										<identifier>i</identifier>
									</term>
								</expression>
								<symbol>,</symbol>
								<expression>
									<term>
										<identifier>x</identifier>
									</term>
									<symbol>+</symbol>
									<term>
										<identifier>boardSize</identifier>
									</term>
									<symbol>-</symbol>
									<term>
										<identifier>i</identifier>
									</term>
								</expression>
								<symbol>,</symbol>
								<expression>
									<term>
										<identifier>y</identifier>
									</term>
								</expression>
							</expressionList>
							<symbol>)</symbol>
							<symbol>;</symbol>
						</doStatement>
						<doStatement>
							<keyword>do</keyword>
							<identifier>Screen</identifier>
							<symbol>.</symbol>
							<identifier>drawLine</identifier>
							<symbol>(</symbol>
							<expressionList>
								<expression>
									<term>
										<identifier>x</identifier>
									</term>
									<symbol>+</symbol>
									<term>
										<identifier>i</identifier>
									</term>
								</expression>
								<symbol>,</symbol>
								<expression>
									<term>
										<identifier>y</identifier>
									</term>
									<symbol>+</symbol>
									<term>
										<identifier>boardSize</identifier>
									</term>
								</expression>
								<symbol>,</symbol>
								<expression>
									<term>
										<identifier>x</identifier>
									</term>
									<symbol>+</symbol>
									<term>
										<identifier>boardSize</identifier>
									</term>
								</expression>
								<symbol>,</symbol>
								<expression>
									<term>
										<identifier>y</identifier>
									</term>
									<symbol>+</symbol>
									<term>
										<identifier>i</identifier>
									</term>
								</expression>
							</expressionList>
							<symbol>)</symbol>
							<symbol>;</symbol>
						</doStatement>
						<letStatement>
							<keyword>let</keyword>
							<identifier>i</identifier>
							<symbol>=</symbol>
							<expression>
								<term>
									<identifier>i</identifier>
								</term>
								<symbol>-</symbol>
								<term>
									<integerConstant>1</integerConstant>
								</term>
							</expression>
							<symbol>;</symbol>
						</letStatement>
					</statements>
					<symbol>}</symbol>
				</whileStatement>
				<returnStatement>
					<keyword>return</keyword>
					<symbol>;</symbol>
				</returnStatement>
			</statements>
			<symbol>}</symbol>
		</subroutineBody>
	</subroutineDec>
	<subroutineDec>
		<keyword>method</keyword>
		<keyword>void</keyword>
		<identifier>drawWin</identifier>
		<symbol>(</symbol>
		<parameterList>
</parameterList>
		<symbol>)</symbol>
		<subroutineBody>
			<symbol>{</symbol>
			<statements>
				<ifStatement>
					<keyword>if</keyword>
					<symbol>(</symbol>
					<expression>
						<term>
							<identifier>winMode</identifier>
						</term>
						<symbol>=</symbol>
						<term>
							<integerConstant>0</integerConstant>
						</term>
					</expression>
					<symbol>)</symbol>
					<symbol>{</symbol>
					<statements>
						<doStatement>
							<keyword>do</keyword>
							<identifier>drawRowWin</identifier>
							<symbol>(</symbol>
							<expressionList>
								<expression>
									<term>
										<identifier>winRow</identifier>
									</term>
								</expression>
							</expressionList>
							<symbol>)</symbol>
							<symbol>;</symbol>
						</doStatement>
					</statements>
					<symbol>}</symbol>
				</ifStatement>
				<ifStatement>
					<keyword>if</keyword>
					<symbol>(</symbol>
					<expression>
						<term>
							<identifier>winMode</identifier>
						</term>
						<symbol>=</symbol>
						<term>
							<integerConstant>1</integerConstant>
						</term>
					</expression>
					<symbol>)</symbol>
					<symbol>{</symbol>
					<statements>
						<doStatement>
							<keyword>do</keyword>
							<identifier>drawColWin</identifier>
							<symbol>(</symbol>
							<expressionList>
								<expression>
									<term>
										<identifier>winCol</identifier>
									</term>
								</expression>
							</expressionList>
							<symbol>)</symbol>
							<symbol>;</symbol>
						</doStatement>
					</statements>
					<symbol>}</symbol>
				</ifStatement>
				<ifStatement>
					<keyword>if</keyword>
					<symbol>(</symbol>
					<expression>
						<term>
							<identifier>winMode</identifier>
						</term>
						<symbol>=</symbol>
						<term>
							<integerConstant>2</integerConstant>
						</term>
					</expression>
					<symbol>)</symbol>
					<symbol>{</symbol>
					<statements>
						<doStatement>
							<keyword>do</keyword>
							<identifier>drawTopDiagonalWin</identifier>
							<symbol>(</symbol>
							<expressionList>
</expressionList>
							<symbol>)</symbol>
							<symbol>;</symbol>
						</doStatement>
					</statements>
					<symbol>}</symbol>
				</ifStatement>
				<ifStatement>
					<keyword>if</keyword>
					<symbol>(</symbol>
					<expression>
						<term>
							<identifier>winMode</identifier>
						</term>
						<symbol>=</symbol>
						<term>
							<integerConstant>3</integerConstant>
						</term>
					</expression>
					<symbol>)</symbol>
					<symbol>{</symbol>
					<statements>
						<doStatement>
							<keyword>do</keyword>
							<identifier>drawBottomDiagonalWin</identifier>
							<symbol>(</symbol>
							<expressionList>
</expressionList>
							<symbol>)</symbol>
							<symbol>;</symbol>
						</doStatement>
					</statements>
					<symbol>}</symbol>
				</ifStatement>
				<returnStatement>
					<keyword>return</keyword>
					<symbol>;</symbol>
				</returnStatement>
			</statements>
			<symbol>}</symbol>
		</subroutineBody>
	</subroutineDec>
	<subroutineDec>
		<keyword>method</keyword>
		<keyword>boolean</keyword>
		<identifier>isWin</identifier>
		<symbol>(</symbol>
		<parameterList>
</parameterList>
		<symbol>)</symbol>
		<subroutineBody>
			<symbol>{</symbol>
			<statements>
				<returnStatement>
					<keyword>return</keyword>
					<expression>
						<term>
							<identifier>isWin</identifier>
						</term>
					</expression>
					<symbol>;</symbol>
				</returnStatement>
			</statements>
			<symbol>}</symbol>
		</subroutineBody>
	</subroutineDec>
	<subroutineDec>
		<keyword>method</keyword>
		<keyword>boolean</keyword>
		<identifier>isDraw</identifier>
		<symbol>(</symbol>
		<parameterList>
</parameterList>
		<symbol>)</symbol>
		<subroutineBody>
			<symbol>{</symbol>
			<statements>
				<returnStatement>
					<keyword>return</keyword>
					<expression>
						<term>
							<identifier>isDraw</identifier>
						</term>
					</expression>
					<symbol>;</symbol>
				</returnStatement>
			</statements>
			<symbol>}</symbol>
		</subroutineBody>
	</subroutineDec>
	<subroutineDec>
		<keyword>method</keyword>
		<keyword>void</keyword>
		<identifier>evaluateBoard</identifier>
		<symbol>(</symbol>
		<parameterList>
</parameterList>
		<symbol>)</symbol>
		<subroutineBody>
			<symbol>{</symbol>
			<varDec>
				<keyword>var</keyword>
				<keyword>int</keyword>
				<identifier>r</identifier>
				<symbol>,</symbol>
				<identifier>c</identifier>
				<symbol>,</symbol>
				<identifier>b1</identifier>
				<symbol>,</symbol>
				<identifier>b2</identifier>
				<symbol>,</symbol>
				<identifier>b3</identifier>
				<symbol>;</symbol>
			</varDec>
			<statements>
				<letStatement>
					<keyword>let</keyword>
					<identifier>r</identifier>
					<symbol>=</symbol>
					<expression>
						<term>
							<integerConstant>0</integerConstant>
						</term>
					</expression>
					<symbol>;</symbol>
				</letStatement>
				<letStatement>
					<keyword>let</keyword>
					<identifier>c</identifier>
					<symbol>=</symbol>
					<expression>
						<term>
							<integerConstant>0</integerConstant>
						</term>
					</expression>
					<symbol>;</symbol>
				</letStatement>
				<letStatement>
					<keyword>let</keyword>
					<identifier>isWin</identifier>
					<symbol>=</symbol>
					<expression>
						<term>
							<keyword>false</keyword>
						</term>
					</expression>
					<symbol>;</symbol>
				</letStatement>
				<letStatement>
					<keyword>let</keyword>
					<identifier>isDraw</identifier>
					<symbol>=</symbol>
					<expression>
						<term>
							<keyword>false</keyword>
						</term>
					</expression>
					<symbol>;</symbol>
				</letStatement>
				<whileStatement>
					<keyword>while</keyword>
					<symbol>(</symbol>
					<expression>
						<term>
							<identifier>r</identifier>
						</term>
						<symbol>&lt;</symbol>
						<term>
							<integerConstant>3</integerConstant>
						</term>
					</expression>
					<symbol>)</symbol>
					<symbol>{</symbol>
					<statements>
						<letStatement>
							<keyword>let</keyword>
							<identifier>b1</identifier>
							<symbol>=</symbol>
							<expression>
								<term>
									<identifier>boardArray</identifier>
									<symbol>[</symbol>
									<expression>
										<term>
											<identifier>posToIndex</identifier>
											<symbol>(</symbol>
											<expressionList>
												<expression>
													<term>
														<identifier>r</identifier>
													</term>
												</expression>
												<symbol>,</symbol>
												<expression>
													<term>
														<integerConstant>0</integerConstant>
													</term>
												</expression>
											</expressionList>
											<symbol>)</symbol>
										</term>
									</expression>
									<symbol>]</symbol>
								</term>
							</expression>
							<symbol>;</symbol>
						</letStatement>
						<letStatement>
							<keyword>let</keyword>
							<identifier>b2</identifier>
							<symbol>=</symbol>
							<expression>
								<term>
									<identifier>boardArray</identifier>
									<symbol>[</symbol>
									<expression>
										<term>
											<identifier>posToIndex</identifier>
											<symbol>(</symbol>
											<expressionList>
												<expression>
													<term>
														<identifier>r</identifier>
													</term>
												</expression>
												<symbol>,</symbol>
												<expression>
													<term>
														<integerConstant>1</integerConstant>
													</term>
												</expression>
											</expressionList>
											<symbol>)</symbol>
										</term>
									</expression>
									<symbol>]</symbol>
								</term>
							</expression>
							<symbol>;</symbol>
						</letStatement>
						<letStatement>
							<keyword>let</keyword>
							<identifier>b3</identifier>
							<symbol>=</symbol>
							<expression>
								<term>
									<identifier>boardArray</identifier>
									<symbol>[</symbol>
									<expression>
										<term>
											<identifier>posToIndex</identifier>
											<symbol>(</symbol>
											<expressionList>
												<expression>
													<term>
														<identifier>r</identifier>
													</term>
												</expression>
												<symbol>,</symbol>
												<expression>
													<term>
														<integerConstant>2</integerConstant>
													</term>
												</expression>
											</expressionList>
											<symbol>)</symbol>
										</term>
									</expression>
									<symbol>]</symbol>
								</term>
							</expression>
							<symbol>;</symbol>
						</letStatement>
						<ifStatement>
							<keyword>if</keyword>
							<symbol>(</symbol>
							<expression>
								<term>
									<symbol>(</symbol>
									<expression>
										<term>
											<identifier>b1</identifier>
										</term>
										<symbol>=</symbol>
										<term>
											<identifier>b2</identifier>
										</term>
									</expression>
									<symbol>)</symbol>
								</term>
								<symbol>&amp;</symbol>
								<term>
									<symbol>(</symbol>
									<expression>
										<term>
											<identifier>b2</identifier>
										</term>
										<symbol>=</symbol>
										<term>
											<identifier>b3</identifier>
										</term>
									</expression>
									<symbol>)</symbol>
								</term>
								<symbol>&amp;</symbol>
								<term>
									<symbol>(</symbol>
									<expression>
										<term>
											<identifier>b1</identifier>
										</term>
										<symbol>&gt;</symbol>
										<term>
											<integerConstant>0</integerConstant>
										</term>
									</expression>
									<symbol>)</symbol>
								</term>
							</expression>
							<symbol>)</symbol>
							<symbol>{</symbol>
							<statements>
								<letStatement>
									<keyword>let</keyword>
									<identifier>isWin</identifier>
									<symbol>=</symbol>
									<expression>
										<term>
											<keyword>true</keyword>
										</term>
									</expression>
									<symbol>;</symbol>
								</letStatement>
								<letStatement>
									<keyword>let</keyword>
									<identifier>winMode</identifier>
									<symbol>=</symbol>
									<expression>
										<term>
											<integerConstant>0</integerConstant>
										</term>
									</expression>
									<symbol>;</symbol>
								</letStatement>
								<letStatement>
									<keyword>let</keyword>
									<identifier>winRow</identifier>
									<symbol>=</symbol>
									<expression>
										<term>
											<identifier>r</identifier>
										</term>
									</expression>
									<symbol>;</symbol>
								</letStatement>
								<returnStatement>
									<keyword>return</keyword>
									<symbol>;</symbol>
								</returnStatement>
							</statements>
							<symbol>}</symbol>
						</ifStatement>
						<letStatement>
							<keyword>let</keyword>
							<identifier>r</identifier>
							<symbol>=</symbol>
							<expression>
								<term>
									<identifier>r</identifier>
								</term>
								<symbol>+</symbol>
								<term>
									<integerConstant>1</integerConstant>
								</term>
							</expression>
							<symbol>;</symbol>
						</letStatement>
					</statements>
					<symbol>}</symbol>
				</whileStatement>
				<whileStatement>
					<keyword>while</keyword>
					<symbol>(</symbol>
					<expression>
						<term>
							<identifier>c</identifier>
						</term>
						<symbol>&lt;</symbol>
						<term>
							<integerConstant>3</integerConstant>
						</term>
					</expression>
					<symbol>)</symbol>
					<symbol>{</symbol>
					<statements>
						<letStatement>
							<keyword>let</keyword>
							<identifier>b1</identifier>
							<symbol>=</symbol>
							<expression>
								<term>
									<identifier>boardArray</identifier>
									<symbol>[</symbol>
									<expression>
										<term>
											<identifier>posToIndex</identifier>
											<symbol>(</symbol>
											<expressionList>
												<expression>
													<term>
														<integerConstant>0</integerConstant>
													</term>
												</expression>
												<symbol>,</symbol>
												<expression>
													<term>
														<identifier>c</identifier>
													</term>
												</expression>
											</expressionList>
											<symbol>)</symbol>
										</term>
									</expression>
									<symbol>]</symbol>
								</term>
							</expression>
							<symbol>;</symbol>
						</letStatement>
						<letStatement>
							<keyword>let</keyword>
							<identifier>b2</identifier>
							<symbol>=</symbol>
							<expression>
								<term>
									<identifier>boardArray</identifier>
									<symbol>[</symbol>
									<expression>
										<term>
											<identifier>posToIndex</identifier>
											<symbol>(</symbol>
											<expressionList>
												<expression>
													<term>
														<integerConstant>1</integerConstant>
													</term>
												</expression>
												<symbol>,</symbol>
												<expression>
													<term>
														<identifier>c</identifier>
													</term>
												</expression>
											</expressionList>
											<symbol>)</symbol>
										</term>
									</expression>
									<symbol>]</symbol>
								</term>
							</expression>
							<symbol>;</symbol>
						</letStatement>
						<letStatement>
							<keyword>let</keyword>
							<identifier>b3</identifier>
							<symbol>=</symbol>
							<expression>
								<term>
									<identifier>boardArray</identifier>
									<symbol>[</symbol>
									<expression>
										<term>
											<identifier>posToIndex</identifier>
											<symbol>(</symbol>
											<expressionList>
												<expression>
													<term>
														<integerConstant>2</integerConstant>
													</term>
												</expression>
												<symbol>,</symbol>
												<expression>
													<term>
														<identifier>c</identifier>
													</term>
												</expression>
											</expressionList>
											<symbol>)</symbol>
										</term>
									</expression>
									<symbol>]</symbol>
								</term>
							</expression>
							<symbol>;</symbol>
						</letStatement>
						<ifStatement>
							<keyword>if</keyword>
							<symbol>(</symbol>
							<expression>
								<term>
									<symbol>(</symbol>
									<expression>
										<term>
											<identifier>b1</identifier>
										</term>
										<symbol>=</symbol>
										<term>
											<identifier>b2</identifier>
										</term>
									</expression>
									<symbol>)</symbol>
								</term>
								<symbol>&amp;</symbol>
								<term>
									<symbol>(</symbol>
									<expression>
										<term>
											<identifier>b2</identifier>
										</term>
										<symbol>=</symbol>
										<term>
											<identifier>b3</identifier>
										</term>
									</expression>
									<symbol>)</symbol>
								</term>
								<symbol>&amp;</symbol>
								<term>
									<symbol>(</symbol>
									<expression>
										<term>
											<identifier>b1</identifier>
										</term>
										<symbol>&gt;</symbol>
										<term>
											<integerConstant>0</integerConstant>
										</term>
									</expression>
									<symbol>)</symbol>
								</term>
							</expression>
							<symbol>)</symbol>
							<symbol>{</symbol>
							<statements>
								<letStatement>
									<keyword>let</keyword>
									<identifier>isWin</identifier>
									<symbol>=</symbol>
									<expression>
										<term>
											<keyword>true</keyword>
										</term>
									</expression>
									<symbol>;</symbol>
								</letStatement>
								<letStatement>
									<keyword>let</keyword>
									<identifier>winMode</identifier>
									<symbol>=</symbol>
									<expression>
										<term>
											<integerConstant>1</integerConstant>
										</term>
									</expression>
									<symbol>;</symbol>
								</letStatement>
								<letStatement>
									<keyword>let</keyword>
									<identifier>winCol</identifier>
									<symbol>=</symbol>
									<expression>
										<term>
											<identifier>c</identifier>
										</term>
									</expression>
									<symbol>;</symbol>
								</letStatement>
								<returnStatement>
									<keyword>return</keyword>
									<symbol>;</symbol>
								</returnStatement>
							</statements>
							<symbol>}</symbol>
						</ifStatement>
						<letStatement>
							<keyword>let</keyword>
							<identifier>c</identifier>
							<symbol>=</symbol>
							<expression>
								<term>
									<identifier>c</identifier>
								</term>
								<symbol>+</symbol>
								<term>
									<integerConstant>1</integerConstant>
								</term>
							</expression>
							<symbol>;</symbol>
						</letStatement>
					</statements>
					<symbol>}</symbol>
				</whileStatement>
				<letStatement>
					<keyword>let</keyword>
					<identifier>b1</identifier>
					<symbol>=</symbol>
					<expression>
						<term>
							<identifier>boardArray</identifier>
							<symbol>[</symbol>
							<expression>
								<term>
									<integerConstant>0</integerConstant>
								</term>
							</expression>
							<symbol>]</symbol>
						</term>
					</expression>
					<symbol>;</symbol>
				</letStatement>
				<letStatement>
					<keyword>let</keyword>
					<identifier>b2</identifier>
					<symbol>=</symbol>
					<expression>
						<term>
							<identifier>boardArray</identifier>
							<symbol>[</symbol>
							<expression>
								<term>
									<integerConstant>4</integerConstant>
								</term>
							</expression>
							<symbol>]</symbol>
						</term>
					</expression>
					<symbol>;</symbol>
				</letStatement>
				<letStatement>
					<keyword>let</keyword>
					<identifier>b3</identifier>
					<symbol>=</symbol>
					<expression>
						<term>
							<identifier>boardArray</identifier>
							<symbol>[</symbol>
							<expression>
								<term>
									<integerConstant>8</integerConstant>
								</term>
							</expression>
							<symbol>]</symbol>
						</term>
					</expression>
					<symbol>;</symbol>
				</letStatement>
				<ifStatement>
					<keyword>if</keyword>
					<symbol>(</symbol>
					<expression>
						<term>
							<symbol>(</symbol>
							<expression>
								<term>
									<identifier>b1</identifier>
								</term>
								<symbol>=</symbol>
								<term>
									<identifier>b2</identifier>
								</term>
							</expression>
							<symbol>)</symbol>
						</term>
						<symbol>&amp;</symbol>
						<term>
							<symbol>(</symbol>
							<expression>
								<term>
									<identifier>b2</identifier>
								</term>
								<symbol>=</symbol>
								<term>
									<identifier>b3</identifier>
								</term>
							</expression>
							<symbol>)</symbol>
						</term>
						<symbol>&amp;</symbol>
						<term>
							<symbol>(</symbol>
							<expression>
								<term>
									<identifier>b1</identifier>
								</term>
								<symbol>&gt;</symbol>
								<term>
									<integerConstant>0</integerConstant>
								</term>
							</expression>
							<symbol>)</symbol>
						</term>
					</expression>
					<symbol>)</symbol>
					<symbol>{</symbol>
					<statements>
						<letStatement>
							<keyword>let</keyword>
							<identifier>isWin</identifier>
							<symbol>=</symbol>
							<expression>
								<term>
									<keyword>true</keyword>
								</term>
							</expression>
							<symbol>;</symbol>
						</letStatement>
						<letStatement>
							<keyword>let</keyword>
							<identifier>winMode</identifier>
							<symbol>=</symbol>
							<expression>
								<term>
									<integerConstant>2</integerConstant>
								</term>
							</expression>
							<symbol>;</symbol>
						</letStatement>
						<returnStatement>
							<keyword>return</keyword>
							<symbol>;</symbol>
						</returnStatement>
					</statements>
					<symbol>}</symbol>
				</ifStatement>
				<letStatement>
					<keyword>let</keyword>
					<identifier>b1</identifier>
					<symbol>=</symbol>
					<expression>
						<term>
							<identifier>boardArray</identifier>
							<symbol>[</symbol>
							<expression>
								<term>
									<integerConstant>6</integerConstant>
								</term>
							</expression>
							<symbol>]</symbol>
						</term>
					</expression>
					<symbol>;</symbol>
				</letStatement>
				<letStatement>
					<keyword>let</keyword>
					<identifier>b2</identifier>
					<symbol>=</symbol>
					<expression>
						<term>
							<identifier>boardArray</identifier>
							<symbol>[</symbol>
							<expression>
								<term>
									<integerConstant>4</integerConstant>
								</term>
							</expression>
							<symbol>]</symbol>
						</term>
					</expression>
					<symbol>;</symbol>
				</letStatement>
				<letStatement>
					<keyword>let</keyword>
					<identifier>b3</identifier>
					<symbol>=</symbol>
					<expression>
						<term>
							<identifier>boardArray</identifier>
							<symbol>[</symbol>
							<expression>
								<term>
									<integerConstant>2</integerConstant>
								</term>
							</expression>
							<symbol>]</symbol>
						</term>
					</expression>
					<symbol>;</symbol>
				</letStatement>
				<ifStatement>
					<keyword>if</keyword>
					<symbol>(</symbol>
					<expression>
						<term>
							<symbol>(</symbol>
							<expression>
								<term>
									<identifier>b1</identifier>
								</term>
								<symbol>=</symbol>
								<term>
									<identifier>b2</identifier>
								</term>
							</expression>
							<symbol>)</symbol>
						</term>
						<symbol>&amp;</symbol>
						<term>
							<symbol>(</symbol>
							<expression>
								<term>
									<identifier>b2</identifier>
								</term>
								<symbol>=</symbol>
								<term>
									<identifier>b3</identifier>
								</term>
							</expression>
							<symbol>)</symbol>
						</term>
						<symbol>&amp;</symbol>
						<term>
							<symbol>(</symbol>
							<expression>
								<term>
									<identifier>b1</identifier>
								</term>
								<symbol>&gt;</symbol>
								<term>
									<integerConstant>0</integerConstant>
								</term>
							</expression>
							<symbol>)</symbol>
						</term>
					</expression>
					<symbol>)</symbol>
					<symbol>{</symbol>
					<statements>
						<letStatement>
							<keyword>let</keyword>
							<identifier>isWin</identifier>
							<symbol>=</symbol>
							<expression>
								<term>
									<keyword>true</keyword>
								</term>
							</expression>
							<symbol>;</symbol>
						</letStatement>
						<letStatement>
							<keyword>let</keyword>
							<identifier>winMode</identifier>
							<symbol>=</symbol>
							<expression>
								<term>
									<integerConstant>3</integerConstant>
								</term>
							</expression>
							<symbol>;</symbol>
						</letStatement>
						<returnStatement>
							<keyword>return</keyword>
							<symbol>;</symbol>
						</returnStatement>
					</statements>
					<symbol>}</symbol>
				</ifStatement>
				<ifStatement>
					<keyword>if</keyword>
					<symbol>(</symbol>
					<expression>
						<term>
							<identifier>freeCellCount</identifier>
						</term>
						<symbol>=</symbol>
						<term>
							<integerConstant>0</integerConstant>
						</term>
					</expression>
					<symbol>)</symbol>
					<symbol>{</symbol>
					<statements>
						<letStatement>
							<keyword>let</keyword>
							<identifier>isDraw</identifier>
							<symbol>=</symbol>
							<expression>
								<term>
									<keyword>true</keyword>
								</term>
							</expression>
							<symbol>;</symbol>
						</letStatement>
						<returnStatement>
							<keyword>return</keyword>
							<symbol>;</symbol>
						</returnStatement>
					</statements>
					<symbol>}</symbol>
				</ifStatement>
				<returnStatement>
					<keyword>return</keyword>
					<symbol>;</symbol>
				</returnStatement>
			</statements>
			<symbol>}</symbol>
		</subroutineBody>
	</subroutineDec>
	<subroutineDec>
		<keyword>method</keyword>
		<keyword>void</keyword>
		<identifier>drawMove</identifier>
		<symbol>(</symbol>
		<parameterList>
			<keyword>int</keyword>
			<identifier>row</identifier>
			<symbol>,</symbol>
			<keyword>int</keyword>
			<identifier>col</identifier>
			<symbol>,</symbol>
			<identifier>Piece</identifier>
			<identifier>p</identifier>
		</parameterList>
		<symbol>)</symbol>
		<subroutineBody>
			<symbol>{</symbol>
			<varDec>
				<keyword>var</keyword>
				<keyword>int</keyword>
				<identifier>xl</identifier>
				<symbol>,</symbol>
				<identifier>yt</identifier>
				<symbol>;</symbol>
			</varDec>
			<statements>
				<letStatement>
					<keyword>let</keyword>
					<identifier>xl</identifier>
					<symbol>=</symbol>
					<expression>
						<term>
							<identifier>colToX</identifier>
							<symbol>(</symbol>
							<expressionList>
								<expression>
									<term>
										<identifier>col</identifier>
									</term>
								</expression>
							</expressionList>
							<symbol>)</symbol>
						</term>
						<symbol>+</symbol>
						<term>
							<symbol>(</symbol>
							<expression>
								<term>
									<symbol>(</symbol>
									<expression>
										<term>
											<identifier>cellSize</identifier>
										</term>
										<symbol>-</symbol>
										<term>
											<identifier>p</identifier>
											<symbol>.</symbol>
											<identifier>getWidth</identifier>
											<symbol>(</symbol>
											<expressionList>
</expressionList>
											<symbol>)</symbol>
										</term>
									</expression>
									<symbol>)</symbol>
								</term>
								<symbol>/</symbol>
								<term>
									<integerConstant>2</integerConstant>
								</term>
							</expression>
							<symbol>)</symbol>
						</term>
					</expression>
					<symbol>;</symbol>
				</letStatement>
				<letStatement>
					<keyword>let</keyword>
					<identifier>yt</identifier>
					<symbol>=</symbol>
					<expression>
						<term>
							<identifier>rowToY</identifier>
							<symbol>(</symbol>
							<expressionList>
								<expression>
									<term>
										<identifier>row</identifier>
									</term>
								</expression>
							</expressionList>
							<symbol>)</symbol>
						</term>
						<symbol>+</symbol>
						<term>
							<symbol>(</symbol>
							<expression>
								<term>
									<symbol>(</symbol>
									<expression>
										<term>
											<identifier>cellSize</identifier>
										</term>
										<symbol>-</symbol>
										<term>
											<identifier>p</identifier>
											<symbol>.</symbol>
											<identifier>getHeight</identifier>
											<symbol>(</symbol>
											<expressionList>
</expressionList>
											<symbol>)</symbol>
										</term>
									</expression>
									<symbol>)</symbol>
								</term>
								<symbol>/</symbol>
								<term>
									<integerConstant>2</integerConstant>
								</term>
							</expression>
							<symbol>)</symbol>
						</term>
					</expression>
					<symbol>;</symbol>
				</letStatement>
				<doStatement>
					<keyword>do</keyword>
					<identifier>p</identifier>
					<symbol>.</symbol>
					<identifier>drawPiece</identifier>
					<symbol>(</symbol>
					<expressionList>
						<expression>
							<term>
								<identifier>xl</identifier>
							</term>
						</expression>
						<symbol>,</symbol>
						<expression>
							<term>
								<identifier>yt</identifier>
							</term>
						</expression>
					</expressionList>
					<symbol>)</symbol>
					<symbol>;</symbol>
				</doStatement>
				<returnStatement>
					<keyword>return</keyword>
					<symbol>;</symbol>
				</returnStatement>
			</statements>
			<symbol>}</symbol>
		</subroutineBody>
	</subroutineDec>
	<subroutineDec>
		<keyword>method</keyword>
		<keyword>void</keyword>
		<identifier>makeMove</identifier>
		<symbol>(</symbol>
		<parameterList>
			<keyword>int</keyword>
			<identifier>row</identifier>
			<symbol>,</symbol>
			<keyword>int</keyword>
			<identifier>col</identifier>
			<symbol>,</symbol>
			<identifier>Piece</identifier>
			<identifier>p</identifier>
		</parameterList>
		<symbol>)</symbol>
		<subroutineBody>
			<symbol>{</symbol>
			<statements>
				<letStatement>
					<keyword>let</keyword>
					<identifier>boardArray</identifier>
					<symbol>[</symbol>
					<expression>
						<term>
							<identifier>posToIndex</identifier>
							<symbol>(</symbol>
							<expressionList>
								<expression>
									<term>
										<identifier>row</identifier>
									</term>
								</expression>
								<symbol>,</symbol>
								<expression>
									<term>
										<identifier>col</identifier>
									</term>
								</expression>
							</expressionList>
							<symbol>)</symbol>
						</term>
					</expression>
					<symbol>]</symbol>
					<symbol>=</symbol>
					<expression>
						<term>
							<identifier>p</identifier>
							<symbol>.</symbol>
							<identifier>getType</identifier>
							<symbol>(</symbol>
							<expressionList>
</expressionList>
							<symbol>)</symbol>
						</term>
					</expression>
					<symbol>;</symbol>
				</letStatement>
				<letStatement>
					<keyword>let</keyword>
					<identifier>freeCellCount</identifier>
					<symbol>=</symbol>
					<expression>
						<term>
							<identifier>freeCellCount</identifier>
						</term>
						<symbol>-</symbol>
						<term>
							<integerConstant>1</integerConstant>
						</term>
					</expression>
					<symbol>;</symbol>
				</letStatement>
				<returnStatement>
					<keyword>return</keyword>
					<symbol>;</symbol>
				</returnStatement>
			</statements>
			<symbol>}</symbol>
		</subroutineBody>
	</subroutineDec>
	<subroutineDec>
		<keyword>method</keyword>
		<keyword>void</keyword>
		<identifier>takeBackMove</identifier>
		<symbol>(</symbol>
		<parameterList>
			<keyword>int</keyword>
			<identifier>row</identifier>
			<symbol>,</symbol>
			<keyword>int</keyword>
			<identifier>col</identifier>
			<symbol>,</symbol>
			<identifier>Piece</identifier>
			<identifier>p</identifier>
		</parameterList>
		<symbol>)</symbol>
		<subroutineBody>
			<symbol>{</symbol>
			<statements>
				<letStatement>
					<keyword>let</keyword>
					<identifier>boardArray</identifier>
					<symbol>[</symbol>
					<expression>
						<term>
							<identifier>posToIndex</identifier>
							<symbol>(</symbol>
							<expressionList>
								<expression>
									<term>
										<identifier>row</identifier>
									</term>
								</expression>
								<symbol>,</symbol>
								<expression>
									<term>
										<identifier>col</identifier>
									</term>
								</expression>
							</expressionList>
							<symbol>)</symbol>
						</term>
					</expression>
					<symbol>]</symbol>
					<symbol>=</symbol>
					<expression>
						<term>
							<integerConstant>0</integerConstant>
						</term>
					</expression>
					<symbol>;</symbol>
				</letStatement>
				<letStatement>
					<keyword>let</keyword>
					<identifier>freeCellCount</identifier>
					<symbol>=</symbol>
					<expression>
						<term>
							<identifier>freeCellCount</identifier>
						</term>
						<symbol>+</symbol>
						<term>
							<integerConstant>1</integerConstant>
						</term>
					</expression>
					<symbol>;</symbol>
				</letStatement>
				<returnStatement>
					<keyword>return</keyword>
					<symbol>;</symbol>
				</returnStatement>
			</statements>
			<symbol>}</symbol>
		</subroutineBody>
	</subroutineDec>
	<subroutineDec>
		<keyword>method</keyword>
		<keyword>int</keyword>
		<identifier>getFreeCellCount</identifier>
		<symbol>(</symbol>
		<parameterList>
</parameterList>
		<symbol>)</symbol>
		<subroutineBody>
			<symbol>{</symbol>
			<statements>
				<returnStatement>
					<keyword>return</keyword>
					<expression>
						<term>
							<identifier>freeCellCount</identifier>
						</term>
					</expression>
					<symbol>;</symbol>
				</returnStatement>
			</statements>
			<symbol>}</symbol>
		</subroutineBody>
	</subroutineDec>
	<subroutineDec>
		<keyword>method</keyword>
		<identifier>Array</identifier>
		<identifier>getAvailableMoves</identifier>
		<symbol>(</symbol>
		<parameterList>
</parameterList>
		<symbol>)</symbol>
		<subroutineBody>
			<symbol>{</symbol>
			<varDec>
				<keyword>var</keyword>
				<identifier>Array</identifier>
				<identifier>moves</identifier>
				<symbol>;</symbol>
			</varDec>
			<varDec>
				<keyword>var</keyword>
				<keyword>int</keyword>
				<identifier>r1</identifier>
				<symbol>,</symbol>
				<identifier>c1</identifier>
				<symbol>,</symbol>
				<identifier>counter</identifier>
				<symbol>;</symbol>
			</varDec>
			<statements>
				<letStatement>
					<keyword>let</keyword>
					<identifier>r1</identifier>
					<symbol>=</symbol>
					<expression>
						<term>
							<integerConstant>0</integerConstant>
						</term>
					</expression>
					<symbol>;</symbol>
				</letStatement>
				<letStatement>
					<keyword>let</keyword>
					<identifier>c1</identifier>
					<symbol>=</symbol>
					<expression>
						<term>
							<integerConstant>0</integerConstant>
						</term>
					</expression>
					<symbol>;</symbol>
				</letStatement>
				<letStatement>
					<keyword>let</keyword>
					<identifier>moves</identifier>
					<symbol>=</symbol>
					<expression>
						<term>
							<identifier>Array</identifier>
							<symbol>.</symbol>
							<identifier>new</identifier>
							<symbol>(</symbol>
							<expressionList>
								<expression>
									<term>
										<identifier>freeCellCount</identifier>
									</term>
									<symbol>*</symbol>
									<term>
										<integerConstant>2</integerConstant>
									</term>
								</expression>
							</expressionList>
							<symbol>)</symbol>
						</term>
					</expression>
					<symbol>;</symbol>
				</letStatement>
				<letStatement>
					<keyword>let</keyword>
					<identifier>counter</identifier>
					<symbol>=</symbol>
					<expression>
						<term>
							<integerConstant>0</integerConstant>
						</term>
					</expression>
					<symbol>;</symbol>
				</letStatement>
				<whileStatement>
					<keyword>while</keyword>
					<symbol>(</symbol>
					<expression>
						<term>
							<identifier>r1</identifier>
						</term>
						<symbol>&lt;</symbol>
						<term>
							<integerConstant>3</integerConstant>
						</term>
					</expression>
					<symbol>)</symbol>
					<symbol>{</symbol>
					<statements>
						<letStatement>
							<keyword>let</keyword>
							<identifier>c1</identifier>
							<symbol>=</symbol>
							<expression>
								<term>
									<integerConstant>0</integerConstant>
								</term>
							</expression>
							<symbol>;</symbol>
						</letStatement>
						<whileStatement>
							<keyword>while</keyword>
							<symbol>(</symbol>
							<expression>
								<term>
									<identifier>c1</identifier>
								</term>
								<symbol>&lt;</symbol>
								<term>
									<integerConstant>3</integerConstant>
								</term>
							</expression>
							<symbol>)</symbol>
							<symbol>{</symbol>
							<statements>
								<ifStatement>
									<keyword>if</keyword>
									<symbol>(</symbol>
									<expression>
										<term>
											<identifier>boardArray</identifier>
											<symbol>[</symbol>
											<expression>
												<term>
													<identifier>posToIndex</identifier>
													<symbol>(</symbol>
													<expressionList>
														<expression>
															<term>
																<identifier>r1</identifier>
															</term>
														</expression>
														<symbol>,</symbol>
														<expression>
															<term>
																<identifier>c1</identifier>
															</term>
														</expression>
													</expressionList>
													<symbol>)</symbol>
												</term>
											</expression>
											<symbol>]</symbol>
										</term>
										<symbol>=</symbol>
										<term>
											<integerConstant>0</integerConstant>
										</term>
									</expression>
									<symbol>)</symbol>
									<symbol>{</symbol>
									<statements>
										<letStatement>
											<keyword>let</keyword>
											<identifier>moves</identifier>
											<symbol>[</symbol>
											<expression>
												<term>
													<identifier>counter</identifier>
												</term>
											</expression>
											<symbol>]</symbol>
											<symbol>=</symbol>
											<expression>
												<term>
													<identifier>r1</identifier>
												</term>
											</expression>
											<symbol>;</symbol>
										</letStatement>
										<letStatement>
											<keyword>let</keyword>
											<identifier>moves</identifier>
											<symbol>[</symbol>
											<expression>
												<term>
													<identifier>counter</identifier>
												</term>
												<symbol>+</symbol>
												<term>
													<integerConstant>1</integerConstant>
												</term>
											</expression>
											<symbol>]</symbol>
											<symbol>=</symbol>
											<expression>
												<term>
													<identifier>c1</identifier>
												</term>
											</expression>
											<symbol>;</symbol>
										</letStatement>
										<letStatement>
											<keyword>let</keyword>
											<identifier>counter</identifier>
											<symbol>=</symbol>
											<expression>
												<term>
													<identifier>counter</identifier>
												</term>
												<symbol>+</symbol>
												<term>
													<integerConstant>2</integerConstant>
												</term>
											</expression>
											<symbol>;</symbol>
										</letStatement>
									</statements>
									<symbol>}</symbol>
								</ifStatement>
								<letStatement>
									<keyword>let</keyword>
									<identifier>c1</identifier>
									<symbol>=</symbol>
									<expression>
										<term>
											<identifier>c1</identifier>
										</term>
										<symbol>+</symbol>
										<term>
											<integerConstant>1</integerConstant>
										</term>
									</expression>
									<symbol>;</symbol>
								</letStatement>
							</statements>
							<symbol>}</symbol>
						</whileStatement>
						<letStatement>
							<keyword>let</keyword>
							<identifier>r1</identifier>
							<symbol>=</symbol>
							<expression>
								<term>
									<identifier>r1</identifier>
								</term>
								<symbol>+</symbol>
								<term>
									<integerConstant>1</integerConstant>
								</term>
							</expression>
							<symbol>;</symbol>
						</letStatement>
					</statements>
					<symbol>}</symbol>
				</whileStatement>
				<returnStatement>
					<keyword>return</keyword>
					<expression>
						<term>
							<identifier>moves</identifier>
						</term>
					</expression>
					<symbol>;</symbol>
				</returnStatement>
			</statements>
			<symbol>}</symbol>
		</subroutineBody>
	</subroutineDec>
	<symbol>}</symbol>
</class>
