<class>
	<keyword>class</keyword>
	<identifier>TicTacToeGame</identifier>
	<symbol>{</symbol>
	<classVarDec>
		<keyword>static</keyword>
		<identifier>Board</identifier>
		<identifier>board</identifier>
		<symbol>;</symbol>
	</classVarDec>
	<classVarDec>
		<keyword>static</keyword>
		<identifier>Piece</identifier>
		<identifier>nPiece</identifier>
		<symbol>,</symbol>
		<identifier>cPiece</identifier>
		<symbol>;</symbol>
	</classVarDec>
	<classVarDec>
		<keyword>static</keyword>
		<keyword>int</keyword>
		<identifier>callCounter</identifier>
		<symbol>;</symbol>
	</classVarDec>
	<classVarDec>
		<keyword>static</keyword>
		<keyword>boolean</keyword>
		<identifier>isDisplay</identifier>
		<symbol>;</symbol>
	</classVarDec>
	<classVarDec>
		<keyword>static</keyword>
		<keyword>int</keyword>
		<identifier>p1</identifier>
		<symbol>;</symbol>
	</classVarDec>
	<subroutineDec>
		<keyword>function</keyword>
		<keyword>void</keyword>
		<identifier>init</identifier>
		<symbol>(</symbol>
		<parameterList>
</parameterList>
		<symbol>)</symbol>
		<subroutineBody>
			<symbol>{</symbol>
			<statements>
				<doStatement>
					<keyword>do</keyword>
					<identifier>InputUtil</identifier>
					<symbol>.</symbol>
					<identifier>init</identifier>
					<symbol>(</symbol>
					<expressionList>
</expressionList>
					<symbol>)</symbol>
					<symbol>;</symbol>
				</doStatement>
				<letStatement>
					<keyword>let</keyword>
					<identifier>nPiece</identifier>
					<symbol>=</symbol>
					<expression>
						<term>
							<identifier>Piece</identifier>
							<symbol>.</symbol>
							<identifier>new</identifier>
							<symbol>(</symbol>
							<expressionList>
								<expression>
									<term>
										<integerConstant>1</integerConstant>
									</term>
								</expression>
							</expressionList>
							<symbol>)</symbol>
						</term>
					</expression>
					<symbol>;</symbol>
				</letStatement>
				<letStatement>
					<keyword>let</keyword>
					<identifier>cPiece</identifier>
					<symbol>=</symbol>
					<expression>
						<term>
							<identifier>Piece</identifier>
							<symbol>.</symbol>
							<identifier>new</identifier>
							<symbol>(</symbol>
							<expressionList>
								<expression>
									<term>
										<integerConstant>2</integerConstant>
									</term>
								</expression>
							</expressionList>
							<symbol>)</symbol>
						</term>
					</expression>
					<symbol>;</symbol>
				</letStatement>
				<returnStatement>
					<keyword>return</keyword>
					<symbol>;</symbol>
				</returnStatement>
			</statements>
			<symbol>}</symbol>
		</subroutineBody>
	</subroutineDec>
	<subroutineDec>
		<keyword>function</keyword>
		<keyword>void</keyword>
		<identifier>resetStat</identifier>
		<symbol>(</symbol>
		<parameterList>
</parameterList>
		<symbol>)</symbol>
		<subroutineBody>
			<symbol>{</symbol>
			<statements>
				<letStatement>
					<keyword>let</keyword>
					<identifier>p1</identifier>
					<symbol>=</symbol>
					<expression>
						<term>
							<integerConstant>0</integerConstant>
						</term>
					</expression>
					<symbol>;</symbol>
				</letStatement>
				<returnStatement>
					<keyword>return</keyword>
					<symbol>;</symbol>
				</returnStatement>
			</statements>
			<symbol>}</symbol>
		</subroutineBody>
	</subroutineDec>
	<subroutineDec>
		<keyword>function</keyword>
		<keyword>void</keyword>
		<identifier>incStat</identifier>
		<symbol>(</symbol>
		<parameterList>
</parameterList>
		<symbol>)</symbol>
		<subroutineBody>
			<symbol>{</symbol>
			<varDec>
				<keyword>var</keyword>
				<identifier>String</identifier>
				<identifier>s</identifier>
				<symbol>;</symbol>
			</varDec>
			<statements>
				<letStatement>
					<keyword>let</keyword>
					<identifier>p1</identifier>
					<symbol>=</symbol>
					<expression>
						<term>
							<identifier>p1</identifier>
						</term>
						<symbol>+</symbol>
						<term>
							<integerConstant>1</integerConstant>
						</term>
					</expression>
					<symbol>;</symbol>
				</letStatement>
				<ifStatement>
					<keyword>if</keyword>
					<symbol>(</symbol>
					<expression>
						<term>
							<identifier>p1</identifier>
						</term>
						<symbol>=</symbol>
						<term>
							<integerConstant>1</integerConstant>
						</term>
					</expression>
					<symbol>)</symbol>
					<symbol>{</symbol>
					<statements>
						<doStatement>
							<keyword>do</keyword>
							<identifier>InputUtil</identifier>
							<symbol>.</symbol>
							<identifier>showMessage</identifier>
							<symbol>(</symbol>
							<expressionList>
								<expression>
									<term>
										<stringConstant>Thinking... /</stringConstant>
									</term>
								</expression>
							</expressionList>
							<symbol>)</symbol>
							<symbol>;</symbol>
						</doStatement>
						<returnStatement>
							<keyword>return</keyword>
							<symbol>;</symbol>
						</returnStatement>
					</statements>
					<symbol>}</symbol>
				</ifStatement>
				<ifStatement>
					<keyword>if</keyword>
					<symbol>(</symbol>
					<expression>
						<term>
							<identifier>p1</identifier>
						</term>
						<symbol>=</symbol>
						<term>
							<integerConstant>100</integerConstant>
						</term>
					</expression>
					<symbol>)</symbol>
					<symbol>{</symbol>
					<statements>
						<doStatement>
							<keyword>do</keyword>
							<identifier>InputUtil</identifier>
							<symbol>.</symbol>
							<identifier>showMessage</identifier>
							<symbol>(</symbol>
							<expressionList>
								<expression>
									<term>
										<stringConstant>Thinking... -</stringConstant>
									</term>
								</expression>
							</expressionList>
							<symbol>)</symbol>
							<symbol>;</symbol>
						</doStatement>
						<returnStatement>
							<keyword>return</keyword>
							<symbol>;</symbol>
						</returnStatement>
					</statements>
					<symbol>}</symbol>
				</ifStatement>
				<ifStatement>
					<keyword>if</keyword>
					<symbol>(</symbol>
					<expression>
						<term>
							<identifier>p1</identifier>
						</term>
						<symbol>=</symbol>
						<term>
							<integerConstant>200</integerConstant>
						</term>
					</expression>
					<symbol>)</symbol>
					<symbol>{</symbol>
					<statements>
						<doStatement>
							<keyword>do</keyword>
							<identifier>InputUtil</identifier>
							<symbol>.</symbol>
							<identifier>showMessage</identifier>
							<symbol>(</symbol>
							<expressionList>
								<expression>
									<term>
										<stringConstant>Thinking... \\</stringConstant>
									</term>
								</expression>
							</expressionList>
							<symbol>)</symbol>
							<symbol>;</symbol>
						</doStatement>
						<returnStatement>
							<keyword>return</keyword>
							<symbol>;</symbol>
						</returnStatement>
					</statements>
					<symbol>}</symbol>
				</ifStatement>
				<ifStatement>
					<keyword>if</keyword>
					<symbol>(</symbol>
					<expression>
						<term>
							<identifier>p1</identifier>
						</term>
						<symbol>=</symbol>
						<term>
							<integerConstant>300</integerConstant>
						</term>
					</expression>
					<symbol>)</symbol>
					<symbol>{</symbol>
					<statements>
						<doStatement>
							<keyword>do</keyword>
							<identifier>InputUtil</identifier>
							<symbol>.</symbol>
							<identifier>showMessage</identifier>
							<symbol>(</symbol>
							<expressionList>
								<expression>
									<term>
										<stringConstant>Thinking... |</stringConstant>
									</term>
								</expression>
							</expressionList>
							<symbol>)</symbol>
							<symbol>;</symbol>
						</doStatement>
						<returnStatement>
							<keyword>return</keyword>
							<symbol>;</symbol>
						</returnStatement>
					</statements>
					<symbol>}</symbol>
				</ifStatement>
				<ifStatement>
					<keyword>if</keyword>
					<symbol>(</symbol>
					<expression>
						<term>
							<identifier>p1</identifier>
						</term>
						<symbol>=</symbol>
						<term>
							<integerConstant>400</integerConstant>
						</term>
					</expression>
					<symbol>)</symbol>
					<symbol>{</symbol>
					<statements>
						<letStatement>
							<keyword>let</keyword>
							<identifier>p1</identifier>
							<symbol>=</symbol>
							<expression>
								<term>
									<integerConstant>0</integerConstant>
								</term>
							</expression>
							<symbol>;</symbol>
						</letStatement>
					</statements>
					<symbol>}</symbol>
				</ifStatement>
				<returnStatement>
					<keyword>return</keyword>
					<symbol>;</symbol>
				</returnStatement>
			</statements>
			<symbol>}</symbol>
		</subroutineBody>
	</subroutineDec>
	<subroutineDec>
		<keyword>function</keyword>
		<keyword>int</keyword>
		<identifier>processBoard</identifier>
		<symbol>(</symbol>
		<parameterList>
</parameterList>
		<symbol>)</symbol>
		<subroutineBody>
			<symbol>{</symbol>
			<statements>
				<doStatement>
					<keyword>do</keyword>
					<identifier>board</identifier>
					<symbol>.</symbol>
					<identifier>evaluateBoard</identifier>
					<symbol>(</symbol>
					<expressionList>
</expressionList>
					<symbol>)</symbol>
					<symbol>;</symbol>
				</doStatement>
				<ifStatement>
					<keyword>if</keyword>
					<symbol>(</symbol>
					<expression>
						<term>
							<identifier>board</identifier>
							<symbol>.</symbol>
							<identifier>isWin</identifier>
							<symbol>(</symbol>
							<expressionList>
</expressionList>
							<symbol>)</symbol>
						</term>
					</expression>
					<symbol>)</symbol>
					<symbol>{</symbol>
					<statements>
						<doStatement>
							<keyword>do</keyword>
							<identifier>board</identifier>
							<symbol>.</symbol>
							<identifier>drawWin</identifier>
							<symbol>(</symbol>
							<expressionList>
</expressionList>
							<symbol>)</symbol>
							<symbol>;</symbol>
						</doStatement>
					</statements>
					<symbol>}</symbol>
				</ifStatement>
				<ifStatement>
					<keyword>if</keyword>
					<symbol>(</symbol>
					<expression>
						<term>
							<identifier>board</identifier>
							<symbol>.</symbol>
							<identifier>isWin</identifier>
							<symbol>(</symbol>
							<expressionList>
</expressionList>
							<symbol>)</symbol>
						</term>
					</expression>
					<symbol>)</symbol>
					<symbol>{</symbol>
					<statements>
						<returnStatement>
							<keyword>return</keyword>
							<expression>
								<term>
									<integerConstant>3</integerConstant>
								</term>
							</expression>
							<symbol>;</symbol>
						</returnStatement>
					</statements>
					<symbol>}</symbol>
				</ifStatement>
				<ifStatement>
					<keyword>if</keyword>
					<symbol>(</symbol>
					<expression>
						<term>
							<identifier>board</identifier>
							<symbol>.</symbol>
							<identifier>isDraw</identifier>
							<symbol>(</symbol>
							<expressionList>
</expressionList>
							<symbol>)</symbol>
						</term>
					</expression>
					<symbol>)</symbol>
					<symbol>{</symbol>
					<statements>
						<returnStatement>
							<keyword>return</keyword>
							<expression>
								<term>
									<integerConstant>2</integerConstant>
								</term>
							</expression>
							<symbol>;</symbol>
						</returnStatement>
					</statements>
					<symbol>}</symbol>
				</ifStatement>
				<returnStatement>
					<keyword>return</keyword>
					<expression>
						<term>
							<integerConstant>1</integerConstant>
						</term>
					</expression>
					<symbol>;</symbol>
				</returnStatement>
			</statements>
			<symbol>}</symbol>
		</subroutineBody>
	</subroutineDec>
	<subroutineDec>
		<keyword>function</keyword>
		<keyword>int</keyword>
		<identifier>play</identifier>
		<symbol>(</symbol>
		<parameterList>
			<keyword>int</keyword>
			<identifier>player</identifier>
			<symbol>,</symbol>
			<identifier>Piece</identifier>
			<identifier>p</identifier>
		</parameterList>
		<symbol>)</symbol>
		<subroutineBody>
			<symbol>{</symbol>
			<varDec>
				<keyword>var</keyword>
				<keyword>boolean</keyword>
				<identifier>validPlayerInput</identifier>
				<symbol>;</symbol>
			</varDec>
			<varDec>
				<keyword>var</keyword>
				<keyword>int</keyword>
				<identifier>input</identifier>
				<symbol>;</symbol>
			</varDec>
			<varDec>
				<keyword>var</keyword>
				<identifier>Array</identifier>
				<identifier>playerMove</identifier>
				<symbol>,</symbol>
				<identifier>computerMove</identifier>
				<symbol>;</symbol>
			</varDec>
			<statements>
				<letStatement>
					<keyword>let</keyword>
					<identifier>validPlayerInput</identifier>
					<symbol>=</symbol>
					<expression>
						<term>
							<keyword>false</keyword>
						</term>
					</expression>
					<symbol>;</symbol>
				</letStatement>
				<ifStatement>
					<keyword>if</keyword>
					<symbol>(</symbol>
					<expression>
						<term>
							<identifier>player</identifier>
						</term>
						<symbol>=</symbol>
						<term>
							<integerConstant>0</integerConstant>
						</term>
					</expression>
					<symbol>)</symbol>
					<symbol>{</symbol>
					<statements>
						<whileStatement>
							<keyword>while</keyword>
							<symbol>(</symbol>
							<expression>
								<term>
									<symbol>~</symbol>
									<term>
										<identifier>validPlayerInput</identifier>
									</term>
								</term>
							</expression>
							<symbol>)</symbol>
							<symbol>{</symbol>
							<statements>
								<letStatement>
									<keyword>let</keyword>
									<identifier>input</identifier>
									<symbol>=</symbol>
									<expression>
										<term>
											<identifier>InputUtil</identifier>
											<symbol>.</symbol>
											<identifier>readInput</identifier>
											<symbol>(</symbol>
											<expressionList>
												<expression>
													<term>
														<stringConstant>Enter move (1 to 9 or 0 to restart):</stringConstant>
													</term>
												</expression>
											</expressionList>
											<symbol>)</symbol>
										</term>
									</expression>
									<symbol>;</symbol>
								</letStatement>
								<ifStatement>
									<keyword>if</keyword>
									<symbol>(</symbol>
									<expression>
										<term>
											<identifier>input</identifier>
										</term>
										<symbol>=</symbol>
										<term>
											<integerConstant>0</integerConstant>
										</term>
									</expression>
									<symbol>)</symbol>
									<symbol>{</symbol>
									<statements>
										<returnStatement>
											<keyword>return</keyword>
											<expression>
												<term>
													<integerConstant>0</integerConstant>
												</term>
											</expression>
											<symbol>;</symbol>
										</returnStatement>
									</statements>
									<symbol>}</symbol>
								</ifStatement>
								<letStatement>
									<keyword>let</keyword>
									<identifier>playerMove</identifier>
									<symbol>=</symbol>
									<expression>
										<term>
											<identifier>TicTacToeGame</identifier>
											<symbol>.</symbol>
											<identifier>inputToMove</identifier>
											<symbol>(</symbol>
											<expressionList>
												<expression>
													<term>
														<identifier>input</identifier>
													</term>
												</expression>
											</expressionList>
											<symbol>)</symbol>
										</term>
									</expression>
									<symbol>;</symbol>
								</letStatement>
								<letStatement>
									<keyword>let</keyword>
									<identifier>validPlayerInput</identifier>
									<symbol>=</symbol>
									<expression>
										<term>
											<identifier>board</identifier>
											<symbol>.</symbol>
											<identifier>isFree</identifier>
											<symbol>(</symbol>
											<expressionList>
												<expression>
													<term>
														<identifier>playerMove</identifier>
														<symbol>[</symbol>
														<expression>
															<term>
																<integerConstant>0</integerConstant>
															</term>
														</expression>
														<symbol>]</symbol>
													</term>
												</expression>
												<symbol>,</symbol>
												<expression>
													<term>
														<identifier>playerMove</identifier>
														<symbol>[</symbol>
														<expression>
															<term>
																<integerConstant>1</integerConstant>
															</term>
														</expression>
														<symbol>]</symbol>
													</term>
												</expression>
											</expressionList>
											<symbol>)</symbol>
										</term>
									</expression>
									<symbol>;</symbol>
								</letStatement>
							</statements>
							<symbol>}</symbol>
						</whileStatement>
						<doStatement>
							<keyword>do</keyword>
							<identifier>board</identifier>
							<symbol>.</symbol>
							<identifier>makeMove</identifier>
							<symbol>(</symbol>
							<expressionList>
								<expression>
									<term>
										<identifier>playerMove</identifier>
										<symbol>[</symbol>
										<expression>
											<term>
												<integerConstant>0</integerConstant>
											</term>
										</expression>
										<symbol>]</symbol>
									</term>
								</expression>
								<symbol>,</symbol>
								<expression>
									<term>
										<identifier>playerMove</identifier>
										<symbol>[</symbol>
										<expression>
											<term>
												<integerConstant>1</integerConstant>
											</term>
										</expression>
										<symbol>]</symbol>
									</term>
								</expression>
								<symbol>,</symbol>
								<expression>
									<term>
										<identifier>p</identifier>
									</term>
								</expression>
							</expressionList>
							<symbol>)</symbol>
							<symbol>;</symbol>
						</doStatement>
						<doStatement>
							<keyword>do</keyword>
							<identifier>board</identifier>
							<symbol>.</symbol>
							<identifier>drawMove</identifier>
							<symbol>(</symbol>
							<expressionList>
								<expression>
									<term>
										<identifier>playerMove</identifier>
										<symbol>[</symbol>
										<expression>
											<term>
												<integerConstant>0</integerConstant>
											</term>
										</expression>
										<symbol>]</symbol>
									</term>
								</expression>
								<symbol>,</symbol>
								<expression>
									<term>
										<identifier>playerMove</identifier>
										<symbol>[</symbol>
										<expression>
											<term>
												<integerConstant>1</integerConstant>
											</term>
										</expression>
										<symbol>]</symbol>
									</term>
								</expression>
								<symbol>,</symbol>
								<expression>
									<term>
										<identifier>p</identifier>
									</term>
								</expression>
							</expressionList>
							<symbol>)</symbol>
							<symbol>;</symbol>
						</doStatement>
						<doStatement>
							<keyword>do</keyword>
							<identifier>playerMove</identifier>
							<symbol>.</symbol>
							<identifier>dispose</identifier>
							<symbol>(</symbol>
							<expressionList>
</expressionList>
							<symbol>)</symbol>
							<symbol>;</symbol>
						</doStatement>
						<returnStatement>
							<keyword>return</keyword>
							<expression>
								<term>
									<identifier>TicTacToeGame</identifier>
									<symbol>.</symbol>
									<identifier>processBoard</identifier>
									<symbol>(</symbol>
									<expressionList>
</expressionList>
									<symbol>)</symbol>
								</term>
							</expression>
							<symbol>;</symbol>
						</returnStatement>
					</statements>
					<symbol>}</symbol>
					<keyword>else</keyword>
					<symbol>{</symbol>
					<statements>
						<letStatement>
							<keyword>let</keyword>
							<identifier>computerMove</identifier>
							<symbol>=</symbol>
							<expression>
								<term>
									<identifier>TicTacToeGame</identifier>
									<symbol>.</symbol>
									<identifier>getComputerMove</identifier>
									<symbol>(</symbol>
									<expressionList>
										<expression>
											<term>
												<identifier>p</identifier>
											</term>
										</expression>
									</expressionList>
									<symbol>)</symbol>
								</term>
							</expression>
							<symbol>;</symbol>
						</letStatement>
						<doStatement>
							<keyword>do</keyword>
							<identifier>board</identifier>
							<symbol>.</symbol>
							<identifier>makeMove</identifier>
							<symbol>(</symbol>
							<expressionList>
								<expression>
									<term>
										<identifier>computerMove</identifier>
										<symbol>[</symbol>
										<expression>
											<term>
												<integerConstant>0</integerConstant>
											</term>
										</expression>
										<symbol>]</symbol>
									</term>
								</expression>
								<symbol>,</symbol>
								<expression>
									<term>
										<identifier>computerMove</identifier>
										<symbol>[</symbol>
										<expression>
											<term>
												<integerConstant>1</integerConstant>
											</term>
										</expression>
										<symbol>]</symbol>
									</term>
								</expression>
								<symbol>,</symbol>
								<expression>
									<term>
										<identifier>p</identifier>
									</term>
								</expression>
							</expressionList>
							<symbol>)</symbol>
							<symbol>;</symbol>
						</doStatement>
						<doStatement>
							<keyword>do</keyword>
							<identifier>board</identifier>
							<symbol>.</symbol>
							<identifier>drawMove</identifier>
							<symbol>(</symbol>
							<expressionList>
								<expression>
									<term>
										<identifier>computerMove</identifier>
										<symbol>[</symbol>
										<expression>
											<term>
												<integerConstant>0</integerConstant>
											</term>
										</expression>
										<symbol>]</symbol>
									</term>
								</expression>
								<symbol>,</symbol>
								<expression>
									<term>
										<identifier>computerMove</identifier>
										<symbol>[</symbol>
										<expression>
											<term>
												<integerConstant>1</integerConstant>
											</term>
										</expression>
										<symbol>]</symbol>
									</term>
								</expression>
								<symbol>,</symbol>
								<expression>
									<term>
										<identifier>p</identifier>
									</term>
								</expression>
							</expressionList>
							<symbol>)</symbol>
							<symbol>;</symbol>
						</doStatement>
						<doStatement>
							<keyword>do</keyword>
							<identifier>computerMove</identifier>
							<symbol>.</symbol>
							<identifier>dispose</identifier>
							<symbol>(</symbol>
							<expressionList>
</expressionList>
							<symbol>)</symbol>
							<symbol>;</symbol>
						</doStatement>
						<returnStatement>
							<keyword>return</keyword>
							<expression>
								<term>
									<identifier>TicTacToeGame</identifier>
									<symbol>.</symbol>
									<identifier>processBoard</identifier>
									<symbol>(</symbol>
									<expressionList>
</expressionList>
									<symbol>)</symbol>
								</term>
							</expression>
							<symbol>;</symbol>
						</returnStatement>
					</statements>
					<symbol>}</symbol>
				</ifStatement>
			</statements>
			<symbol>}</symbol>
		</subroutineBody>
	</subroutineDec>
	<subroutineDec>
		<keyword>function</keyword>
		<keyword>void</keyword>
		<identifier>startGame</identifier>
		<symbol>(</symbol>
		<parameterList>
</parameterList>
		<symbol>)</symbol>
		<subroutineBody>
			<symbol>{</symbol>
			<varDec>
				<keyword>var</keyword>
				<keyword>int</keyword>
				<identifier>currentPlayer</identifier>
				<symbol>,</symbol>
				<identifier>currentPiece</identifier>
				<symbol>;</symbol>
			</varDec>
			<varDec>
				<keyword>var</keyword>
				<keyword>boolean</keyword>
				<identifier>gameOver</identifier>
				<symbol>;</symbol>
			</varDec>
			<varDec>
				<keyword>var</keyword>
				<keyword>int</keyword>
				<identifier>gameStatus</identifier>
				<symbol>;</symbol>
			</varDec>
			<statements>
				<doStatement>
					<keyword>do</keyword>
					<identifier>TicTacToeGame</identifier>
					<symbol>.</symbol>
					<identifier>showCredits</identifier>
					<symbol>(</symbol>
					<expressionList>
</expressionList>
					<symbol>)</symbol>
					<symbol>;</symbol>
				</doStatement>
				<doStatement>
					<keyword>do</keyword>
					<identifier>InputUtil</identifier>
					<symbol>.</symbol>
					<identifier>showMessage</identifier>
					<symbol>(</symbol>
					<expressionList>
						<expression>
							<term>
								<stringConstant>Press enter to start the game!</stringConstant>
							</term>
						</expression>
					</expressionList>
					<symbol>)</symbol>
					<symbol>;</symbol>
				</doStatement>
				<doStatement>
					<keyword>do</keyword>
					<identifier>TicTacToeGame</identifier>
					<symbol>.</symbol>
					<identifier>seedGame</identifier>
					<symbol>(</symbol>
					<expressionList>
</expressionList>
					<symbol>)</symbol>
					<symbol>;</symbol>
				</doStatement>
				<whileStatement>
					<keyword>while</keyword>
					<symbol>(</symbol>
					<expression>
						<term>
							<keyword>true</keyword>
						</term>
					</expression>
					<symbol>)</symbol>
					<symbol>{</symbol>
					<statements>
						<letStatement>
							<keyword>let</keyword>
							<identifier>currentPlayer</identifier>
							<symbol>=</symbol>
							<expression>
								<term>
									<identifier>InputUtil</identifier>
									<symbol>.</symbol>
									<identifier>waitForZeroOrOne</identifier>
									<symbol>(</symbol>
									<expressionList>
										<expression>
											<term>
												<stringConstant>First move? (0 for you, 1 for computer): </stringConstant>
											</term>
										</expression>
									</expressionList>
									<symbol>)</symbol>
								</term>
							</expression>
							<symbol>;</symbol>
						</letStatement>
						<letStatement>
							<keyword>let</keyword>
							<identifier>currentPiece</identifier>
							<symbol>=</symbol>
							<expression>
								<term>
									<identifier>cPiece</identifier>
								</term>
							</expression>
							<symbol>;</symbol>
						</letStatement>
						<letStatement>
							<keyword>let</keyword>
							<identifier>board</identifier>
							<symbol>=</symbol>
							<expression>
								<term>
									<identifier>Board</identifier>
									<symbol>.</symbol>
									<identifier>new</identifier>
									<symbol>(</symbol>
									<expressionList>
										<expression>
											<term>
												<integerConstant>200</integerConstant>
											</term>
										</expression>
										<symbol>,</symbol>
										<expression>
											<term>
												<integerConstant>60</integerConstant>
											</term>
										</expression>
									</expressionList>
									<symbol>)</symbol>
								</term>
							</expression>
							<symbol>;</symbol>
						</letStatement>
						<letStatement>
							<keyword>let</keyword>
							<identifier>gameOver</identifier>
							<symbol>=</symbol>
							<expression>
								<term>
									<keyword>false</keyword>
								</term>
							</expression>
							<symbol>;</symbol>
						</letStatement>
						<whileStatement>
							<keyword>while</keyword>
							<symbol>(</symbol>
							<expression>
								<term>
									<symbol>~</symbol>
									<term>
										<identifier>gameOver</identifier>
									</term>
								</term>
							</expression>
							<symbol>)</symbol>
							<symbol>{</symbol>
							<statements>
								<letStatement>
									<keyword>let</keyword>
									<identifier>gameStatus</identifier>
									<symbol>=</symbol>
									<expression>
										<term>
											<identifier>TicTacToeGame</identifier>
											<symbol>.</symbol>
											<identifier>play</identifier>
											<symbol>(</symbol>
											<expressionList>
												<expression>
													<term>
														<identifier>currentPlayer</identifier>
													</term>
												</expression>
												<symbol>,</symbol>
												<expression>
													<term>
														<identifier>currentPiece</identifier>
													</term>
												</expression>
											</expressionList>
											<symbol>)</symbol>
										</term>
									</expression>
									<symbol>;</symbol>
								</letStatement>
								<ifStatement>
									<keyword>if</keyword>
									<symbol>(</symbol>
									<expression>
										<term>
											<identifier>gameStatus</identifier>
										</term>
										<symbol>=</symbol>
										<term>
											<integerConstant>0</integerConstant>
										</term>
									</expression>
									<symbol>)</symbol>
									<symbol>{</symbol>
									<statements>
										<letStatement>
											<keyword>let</keyword>
											<identifier>gameOver</identifier>
											<symbol>=</symbol>
											<expression>
												<term>
													<keyword>true</keyword>
												</term>
											</expression>
											<symbol>;</symbol>
										</letStatement>
									</statements>
									<symbol>}</symbol>
								</ifStatement>
								<ifStatement>
									<keyword>if</keyword>
									<symbol>(</symbol>
									<expression>
										<term>
											<identifier>gameStatus</identifier>
										</term>
										<symbol>=</symbol>
										<term>
											<integerConstant>1</integerConstant>
										</term>
									</expression>
									<symbol>)</symbol>
									<symbol>{</symbol>
									<statements>
										<letStatement>
											<keyword>let</keyword>
											<identifier>currentPlayer</identifier>
											<symbol>=</symbol>
											<expression>
												<term>
													<identifier>TicTacToeGame</identifier>
													<symbol>.</symbol>
													<identifier>getOtherPlayer</identifier>
													<symbol>(</symbol>
													<expressionList>
														<expression>
															<term>
																<identifier>currentPlayer</identifier>
															</term>
														</expression>
													</expressionList>
													<symbol>)</symbol>
												</term>
											</expression>
											<symbol>;</symbol>
										</letStatement>
										<letStatement>
											<keyword>let</keyword>
											<identifier>currentPiece</identifier>
											<symbol>=</symbol>
											<expression>
												<term>
													<identifier>TicTacToeGame</identifier>
													<symbol>.</symbol>
													<identifier>getOtherPiece</identifier>
													<symbol>(</symbol>
													<expressionList>
														<expression>
															<term>
																<identifier>currentPiece</identifier>
															</term>
														</expression>
													</expressionList>
													<symbol>)</symbol>
												</term>
											</expression>
											<symbol>;</symbol>
										</letStatement>
									</statements>
									<symbol>}</symbol>
								</ifStatement>
								<ifStatement>
									<keyword>if</keyword>
									<symbol>(</symbol>
									<expression>
										<term>
											<identifier>gameStatus</identifier>
										</term>
										<symbol>=</symbol>
										<term>
											<integerConstant>2</integerConstant>
										</term>
									</expression>
									<symbol>)</symbol>
									<symbol>{</symbol>
									<statements>
										<doStatement>
											<keyword>do</keyword>
											<identifier>InputUtil</identifier>
											<symbol>.</symbol>
											<identifier>showMessage</identifier>
											<symbol>(</symbol>
											<expressionList>
												<expression>
													<term>
														<stringConstant>Game drawn! Press enter to restart!</stringConstant>
													</term>
												</expression>
											</expressionList>
											<symbol>)</symbol>
											<symbol>;</symbol>
										</doStatement>
										<doStatement>
											<keyword>do</keyword>
											<identifier>TicTacToeGame</identifier>
											<symbol>.</symbol>
											<identifier>seedGame</identifier>
											<symbol>(</symbol>
											<expressionList>
</expressionList>
											<symbol>)</symbol>
											<symbol>;</symbol>
										</doStatement>
										<letStatement>
											<keyword>let</keyword>
											<identifier>gameOver</identifier>
											<symbol>=</symbol>
											<expression>
												<term>
													<keyword>true</keyword>
												</term>
											</expression>
											<symbol>;</symbol>
										</letStatement>
									</statements>
									<symbol>}</symbol>
								</ifStatement>
								<ifStatement>
									<keyword>if</keyword>
									<symbol>(</symbol>
									<expression>
										<term>
											<identifier>gameStatus</identifier>
										</term>
										<symbol>=</symbol>
										<term>
											<integerConstant>3</integerConstant>
										</term>
									</expression>
									<symbol>)</symbol>
									<symbol>{</symbol>
									<statements>
										<ifStatement>
											<keyword>if</keyword>
											<symbol>(</symbol>
											<expression>
												<term>
													<identifier>currentPlayer</identifier>
												</term>
												<symbol>=</symbol>
												<term>
													<integerConstant>0</integerConstant>
												</term>
											</expression>
											<symbol>)</symbol>
											<symbol>{</symbol>
											<statements>
												<doStatement>
													<keyword>do</keyword>
													<identifier>InputUtil</identifier>
													<symbol>.</symbol>
													<identifier>showMessage</identifier>
													<symbol>(</symbol>
													<expressionList>
														<expression>
															<term>
																<stringConstant>Congratulations! You won the game!</stringConstant>
															</term>
														</expression>
													</expressionList>
													<symbol>)</symbol>
													<symbol>;</symbol>
												</doStatement>
											</statements>
											<symbol>}</symbol>
											<keyword>else</keyword>
											<symbol>{</symbol>
											<statements>
												<doStatement>
													<keyword>do</keyword>
													<identifier>InputUtil</identifier>
													<symbol>.</symbol>
													<identifier>showMessage</identifier>
													<symbol>(</symbol>
													<expressionList>
														<expression>
															<term>
																<stringConstant>Sorry! You lost the game! Press enter to restart!</stringConstant>
															</term>
														</expression>
													</expressionList>
													<symbol>)</symbol>
													<symbol>;</symbol>
												</doStatement>
											</statements>
											<symbol>}</symbol>
										</ifStatement>
										<doStatement>
											<keyword>do</keyword>
											<identifier>TicTacToeGame</identifier>
											<symbol>.</symbol>
											<identifier>seedGame</identifier>
											<symbol>(</symbol>
											<expressionList>
</expressionList>
											<symbol>)</symbol>
											<symbol>;</symbol>
										</doStatement>
										<letStatement>
											<keyword>let</keyword>
											<identifier>gameOver</identifier>
											<symbol>=</symbol>
											<expression>
												<term>
													<keyword>true</keyword>
												</term>
											</expression>
											<symbol>;</symbol>
										</letStatement>
									</statements>
									<symbol>}</symbol>
								</ifStatement>
							</statements>
							<symbol>}</symbol>
						</whileStatement>
						<doStatement>
							<keyword>do</keyword>
							<identifier>board</identifier>
							<symbol>.</symbol>
							<identifier>dispose</identifier>
							<symbol>(</symbol>
							<expressionList>
</expressionList>
							<symbol>)</symbol>
							<symbol>;</symbol>
						</doStatement>
					</statements>
					<symbol>}</symbol>
				</whileStatement>
				<returnStatement>
					<keyword>return</keyword>
					<symbol>;</symbol>
				</returnStatement>
			</statements>
			<symbol>}</symbol>
		</subroutineBody>
	</subroutineDec>
	<subroutineDec>
		<keyword>function</keyword>
		<identifier>Array</identifier>
		<identifier>getComputerMove</identifier>
		<symbol>(</symbol>
		<parameterList>
			<identifier>Piece</identifier>
			<identifier>p</identifier>
		</parameterList>
		<symbol>)</symbol>
		<subroutineBody>
			<symbol>{</symbol>
			<varDec>
				<keyword>var</keyword>
				<identifier>Array</identifier>
				<identifier>moves</identifier>
				<symbol>;</symbol>
			</varDec>
			<varDec>
				<keyword>var</keyword>
				<identifier>Array</identifier>
				<identifier>movesWithScore</identifier>
				<symbol>;</symbol>
			</varDec>
			<statements>
				<doStatement>
					<keyword>do</keyword>
					<identifier>TicTacToeGame</identifier>
					<symbol>.</symbol>
					<identifier>resetStat</identifier>
					<symbol>(</symbol>
					<expressionList>
</expressionList>
					<symbol>)</symbol>
					<symbol>;</symbol>
				</doStatement>
				<letStatement>
					<keyword>let</keyword>
					<identifier>moves</identifier>
					<symbol>=</symbol>
					<expression>
						<term>
							<identifier>Array</identifier>
							<symbol>.</symbol>
							<identifier>new</identifier>
							<symbol>(</symbol>
							<expressionList>
								<expression>
									<term>
										<integerConstant>2</integerConstant>
									</term>
								</expression>
							</expressionList>
							<symbol>)</symbol>
						</term>
					</expression>
					<symbol>;</symbol>
				</letStatement>
				<ifStatement>
					<keyword>if</keyword>
					<symbol>(</symbol>
					<expression>
						<term>
							<identifier>board</identifier>
							<symbol>.</symbol>
							<identifier>getFreeCellCount</identifier>
							<symbol>(</symbol>
							<expressionList>
</expressionList>
							<symbol>)</symbol>
						</term>
						<symbol>=</symbol>
						<term>
							<integerConstant>9</integerConstant>
						</term>
					</expression>
					<symbol>)</symbol>
					<symbol>{</symbol>
					<statements>
						<returnStatement>
							<keyword>return</keyword>
							<expression>
								<term>
									<identifier>TicTacToeGame</identifier>
									<symbol>.</symbol>
									<identifier>getRandomGoodMove</identifier>
									<symbol>(</symbol>
									<expressionList>
</expressionList>
									<symbol>)</symbol>
								</term>
							</expression>
							<symbol>;</symbol>
						</returnStatement>
					</statements>
					<symbol>}</symbol>
					<keyword>else</keyword>
					<symbol>{</symbol>
					<statements>
						<letStatement>
							<keyword>let</keyword>
							<identifier>movesWithScore</identifier>
							<symbol>=</symbol>
							<expression>
								<term>
									<identifier>TicTacToeGame</identifier>
									<symbol>.</symbol>
									<identifier>getBestMove</identifier>
									<symbol>(</symbol>
									<expressionList>
										<expression>
											<term>
												<identifier>p</identifier>
											</term>
										</expression>
									</expressionList>
									<symbol>)</symbol>
								</term>
							</expression>
							<symbol>;</symbol>
						</letStatement>
						<letStatement>
							<keyword>let</keyword>
							<identifier>moves</identifier>
							<symbol>[</symbol>
							<expression>
								<term>
									<integerConstant>0</integerConstant>
								</term>
							</expression>
							<symbol>]</symbol>
							<symbol>=</symbol>
							<expression>
								<term>
									<identifier>movesWithScore</identifier>
									<symbol>[</symbol>
									<expression>
										<term>
											<integerConstant>1</integerConstant>
										</term>
									</expression>
									<symbol>]</symbol>
								</term>
							</expression>
							<symbol>;</symbol>
						</letStatement>
						<letStatement>
							<keyword>let</keyword>
							<identifier>moves</identifier>
							<symbol>[</symbol>
							<expression>
								<term>
									<integerConstant>1</integerConstant>
								</term>
							</expression>
							<symbol>]</symbol>
							<symbol>=</symbol>
							<expression>
								<term>
									<identifier>movesWithScore</identifier>
									<symbol>[</symbol>
									<expression>
										<term>
											<integerConstant>2</integerConstant>
										</term>
									</expression>
									<symbol>]</symbol>
								</term>
							</expression>
							<symbol>;</symbol>
						</letStatement>
						<doStatement>
							<keyword>do</keyword>
							<identifier>movesWithScore</identifier>
							<symbol>.</symbol>
							<identifier>dispose</identifier>
							<symbol>(</symbol>
							<expressionList>
</expressionList>
							<symbol>)</symbol>
							<symbol>;</symbol>
						</doStatement>
						<returnStatement>
							<keyword>return</keyword>
							<expression>
								<term>
									<identifier>moves</identifier>
								</term>
							</expression>
							<symbol>;</symbol>
						</returnStatement>
					</statements>
					<symbol>}</symbol>
				</ifStatement>
			</statements>
			<symbol>}</symbol>
		</subroutineBody>
	</subroutineDec>
	<subroutineDec>
		<keyword>function</keyword>
		<identifier>Array</identifier>
		<identifier>getBestMove</identifier>
		<symbol>(</symbol>
		<parameterList>
			<identifier>Piece</identifier>
			<identifier>p</identifier>
		</parameterList>
		<symbol>)</symbol>
		<subroutineBody>
			<symbol>{</symbol>
			<varDec>
				<keyword>var</keyword>
				<keyword>int</keyword>
				<identifier>i</identifier>
				<symbol>,</symbol>
				<identifier>moveCount</identifier>
				<symbol>,</symbol>
				<identifier>currentScore</identifier>
				<symbol>,</symbol>
				<identifier>nextScore</identifier>
				<symbol>;</symbol>
			</varDec>
			<varDec>
				<keyword>var</keyword>
				<identifier>Array</identifier>
				<identifier>moveList</identifier>
				<symbol>,</symbol>
				<identifier>bestMove</identifier>
				<symbol>;</symbol>
			</varDec>
			<statements>
				<letStatement>
					<keyword>let</keyword>
					<identifier>i</identifier>
					<symbol>=</symbol>
					<expression>
						<term>
							<integerConstant>0</integerConstant>
						</term>
					</expression>
					<symbol>;</symbol>
				</letStatement>
				<letStatement>
					<keyword>let</keyword>
					<identifier>currentScore</identifier>
					<symbol>=</symbol>
					<expression>
						<term>
							<symbol>-</symbol>
							<term>
								<integerConstant>10</integerConstant>
							</term>
						</term>
					</expression>
					<symbol>;</symbol>
				</letStatement>
				<letStatement>
					<keyword>let</keyword>
					<identifier>bestMove</identifier>
					<symbol>=</symbol>
					<expression>
						<term>
							<identifier>Array</identifier>
							<symbol>.</symbol>
							<identifier>new</identifier>
							<symbol>(</symbol>
							<expressionList>
								<expression>
									<term>
										<integerConstant>3</integerConstant>
									</term>
								</expression>
							</expressionList>
							<symbol>)</symbol>
						</term>
					</expression>
					<symbol>;</symbol>
				</letStatement>
				<letStatement>
					<keyword>let</keyword>
					<identifier>moveCount</identifier>
					<symbol>=</symbol>
					<expression>
						<term>
							<identifier>board</identifier>
							<symbol>.</symbol>
							<identifier>getFreeCellCount</identifier>
							<symbol>(</symbol>
							<expressionList>
</expressionList>
							<symbol>)</symbol>
						</term>
					</expression>
					<symbol>;</symbol>
				</letStatement>
				<letStatement>
					<keyword>let</keyword>
					<identifier>moveList</identifier>
					<symbol>=</symbol>
					<expression>
						<term>
							<identifier>board</identifier>
							<symbol>.</symbol>
							<identifier>getAvailableMoves</identifier>
							<symbol>(</symbol>
							<expressionList>
</expressionList>
							<symbol>)</symbol>
						</term>
					</expression>
					<symbol>;</symbol>
				</letStatement>
				<whileStatement>
					<keyword>while</keyword>
					<symbol>(</symbol>
					<expression>
						<term>
							<identifier>i</identifier>
						</term>
						<symbol>&lt;</symbol>
						<term>
							<identifier>moveCount</identifier>
						</term>
					</expression>
					<symbol>)</symbol>
					<symbol>{</symbol>
					<statements>
						<doStatement>
							<keyword>do</keyword>
							<identifier>TicTacToeGame</identifier>
							<symbol>.</symbol>
							<identifier>incStat</identifier>
							<symbol>(</symbol>
							<expressionList>
</expressionList>
							<symbol>)</symbol>
							<symbol>;</symbol>
						</doStatement>
						<doStatement>
							<keyword>do</keyword>
							<identifier>board</identifier>
							<symbol>.</symbol>
							<identifier>makeMove</identifier>
							<symbol>(</symbol>
							<expressionList>
								<expression>
									<term>
										<identifier>moveList</identifier>
										<symbol>[</symbol>
										<expression>
											<term>
												<identifier>i</identifier>
											</term>
											<symbol>+</symbol>
											<term>
												<identifier>i</identifier>
											</term>
										</expression>
										<symbol>]</symbol>
									</term>
								</expression>
								<symbol>,</symbol>
								<expression>
									<term>
										<identifier>moveList</identifier>
										<symbol>[</symbol>
										<expression>
											<term>
												<identifier>i</identifier>
											</term>
											<symbol>+</symbol>
											<term>
												<identifier>i</identifier>
											</term>
											<symbol>+</symbol>
											<term>
												<integerConstant>1</integerConstant>
											</term>
										</expression>
										<symbol>]</symbol>
									</term>
								</expression>
								<symbol>,</symbol>
								<expression>
									<term>
										<identifier>p</identifier>
									</term>
								</expression>
							</expressionList>
							<symbol>)</symbol>
							<symbol>;</symbol>
						</doStatement>
						<letStatement>
							<keyword>let</keyword>
							<identifier>nextScore</identifier>
							<symbol>=</symbol>
							<expression>
								<term>
									<identifier>TicTacToeGame</identifier>
									<symbol>.</symbol>
									<identifier>getMoveScore</identifier>
									<symbol>(</symbol>
									<expressionList>
										<expression>
											<term>
												<identifier>p</identifier>
											</term>
										</expression>
									</expressionList>
									<symbol>)</symbol>
								</term>
							</expression>
							<symbol>;</symbol>
						</letStatement>
						<ifStatement>
							<keyword>if</keyword>
							<symbol>(</symbol>
							<expression>
								<term>
									<identifier>nextScore</identifier>
								</term>
								<symbol>&gt;</symbol>
								<term>
									<identifier>currentScore</identifier>
								</term>
							</expression>
							<symbol>)</symbol>
							<symbol>{</symbol>
							<statements>
								<letStatement>
									<keyword>let</keyword>
									<identifier>currentScore</identifier>
									<symbol>=</symbol>
									<expression>
										<term>
											<identifier>nextScore</identifier>
										</term>
									</expression>
									<symbol>;</symbol>
								</letStatement>
								<letStatement>
									<keyword>let</keyword>
									<identifier>bestMove</identifier>
									<symbol>[</symbol>
									<expression>
										<term>
											<integerConstant>0</integerConstant>
										</term>
									</expression>
									<symbol>]</symbol>
									<symbol>=</symbol>
									<expression>
										<term>
											<identifier>currentScore</identifier>
										</term>
									</expression>
									<symbol>;</symbol>
								</letStatement>
								<letStatement>
									<keyword>let</keyword>
									<identifier>bestMove</identifier>
									<symbol>[</symbol>
									<expression>
										<term>
											<integerConstant>1</integerConstant>
										</term>
									</expression>
									<symbol>]</symbol>
									<symbol>=</symbol>
									<expression>
										<term>
											<identifier>moveList</identifier>
											<symbol>[</symbol>
											<expression>
												<term>
													<identifier>i</identifier>
												</term>
												<symbol>+</symbol>
												<term>
													<identifier>i</identifier>
												</term>
											</expression>
											<symbol>]</symbol>
										</term>
									</expression>
									<symbol>;</symbol>
								</letStatement>
								<letStatement>
									<keyword>let</keyword>
									<identifier>bestMove</identifier>
									<symbol>[</symbol>
									<expression>
										<term>
											<integerConstant>2</integerConstant>
										</term>
									</expression>
									<symbol>]</symbol>
									<symbol>=</symbol>
									<expression>
										<term>
											<identifier>moveList</identifier>
											<symbol>[</symbol>
											<expression>
												<term>
													<identifier>i</identifier>
												</term>
												<symbol>+</symbol>
												<term>
													<identifier>i</identifier>
												</term>
												<symbol>+</symbol>
												<term>
													<integerConstant>1</integerConstant>
												</term>
											</expression>
											<symbol>]</symbol>
										</term>
									</expression>
									<symbol>;</symbol>
								</letStatement>
							</statements>
							<symbol>}</symbol>
						</ifStatement>
						<doStatement>
							<keyword>do</keyword>
							<identifier>board</identifier>
							<symbol>.</symbol>
							<identifier>takeBackMove</identifier>
							<symbol>(</symbol>
							<expressionList>
								<expression>
									<term>
										<identifier>moveList</identifier>
										<symbol>[</symbol>
										<expression>
											<term>
												<identifier>i</identifier>
											</term>
											<symbol>+</symbol>
											<term>
												<identifier>i</identifier>
											</term>
										</expression>
										<symbol>]</symbol>
									</term>
								</expression>
								<symbol>,</symbol>
								<expression>
									<term>
										<identifier>moveList</identifier>
										<symbol>[</symbol>
										<expression>
											<term>
												<identifier>i</identifier>
											</term>
											<symbol>+</symbol>
											<term>
												<identifier>i</identifier>
											</term>
											<symbol>+</symbol>
											<term>
												<integerConstant>1</integerConstant>
											</term>
										</expression>
										<symbol>]</symbol>
									</term>
								</expression>
								<symbol>,</symbol>
								<expression>
									<term>
										<identifier>p</identifier>
									</term>
								</expression>
							</expressionList>
							<symbol>)</symbol>
							<symbol>;</symbol>
						</doStatement>
						<letStatement>
							<keyword>let</keyword>
							<identifier>i</identifier>
							<symbol>=</symbol>
							<expression>
								<term>
									<identifier>i</identifier>
								</term>
								<symbol>+</symbol>
								<term>
									<integerConstant>1</integerConstant>
								</term>
							</expression>
							<symbol>;</symbol>
						</letStatement>
					</statements>
					<symbol>}</symbol>
				</whileStatement>
				<doStatement>
					<keyword>do</keyword>
					<identifier>moveList</identifier>
					<symbol>.</symbol>
					<identifier>dispose</identifier>
					<symbol>(</symbol>
					<expressionList>
</expressionList>
					<symbol>)</symbol>
					<symbol>;</symbol>
				</doStatement>
				<returnStatement>
					<keyword>return</keyword>
					<expression>
						<term>
							<identifier>bestMove</identifier>
						</term>
					</expression>
					<symbol>;</symbol>
				</returnStatement>
			</statements>
			<symbol>}</symbol>
		</subroutineBody>
	</subroutineDec>
	<subroutineDec>
		<keyword>function</keyword>
		<keyword>int</keyword>
		<identifier>getMoveScore</identifier>
		<symbol>(</symbol>
		<parameterList>
			<identifier>Piece</identifier>
			<identifier>p</identifier>
		</parameterList>
		<symbol>)</symbol>
		<subroutineBody>
			<symbol>{</symbol>
			<varDec>
				<keyword>var</keyword>
				<identifier>Array</identifier>
				<identifier>otherMove</identifier>
				<symbol>;</symbol>
			</varDec>
			<varDec>
				<keyword>var</keyword>
				<keyword>int</keyword>
				<identifier>otherScore</identifier>
				<symbol>;</symbol>
			</varDec>
			<statements>
				<doStatement>
					<keyword>do</keyword>
					<identifier>board</identifier>
					<symbol>.</symbol>
					<identifier>evaluateBoard</identifier>
					<symbol>(</symbol>
					<expressionList>
</expressionList>
					<symbol>)</symbol>
					<symbol>;</symbol>
				</doStatement>
				<ifStatement>
					<keyword>if</keyword>
					<symbol>(</symbol>
					<expression>
						<term>
							<identifier>board</identifier>
							<symbol>.</symbol>
							<identifier>isDraw</identifier>
							<symbol>(</symbol>
							<expressionList>
</expressionList>
							<symbol>)</symbol>
						</term>
					</expression>
					<symbol>)</symbol>
					<symbol>{</symbol>
					<statements>
						<returnStatement>
							<keyword>return</keyword>
							<expression>
								<term>
									<integerConstant>0</integerConstant>
								</term>
							</expression>
							<symbol>;</symbol>
						</returnStatement>
					</statements>
					<symbol>}</symbol>
				</ifStatement>
				<ifStatement>
					<keyword>if</keyword>
					<symbol>(</symbol>
					<expression>
						<term>
							<identifier>board</identifier>
							<symbol>.</symbol>
							<identifier>isWin</identifier>
							<symbol>(</symbol>
							<expressionList>
</expressionList>
							<symbol>)</symbol>
						</term>
					</expression>
					<symbol>)</symbol>
					<symbol>{</symbol>
					<statements>
						<returnStatement>
							<keyword>return</keyword>
							<expression>
								<term>
									<integerConstant>1</integerConstant>
								</term>
							</expression>
							<symbol>;</symbol>
						</returnStatement>
					</statements>
					<symbol>}</symbol>
				</ifStatement>
				<letStatement>
					<keyword>let</keyword>
					<identifier>otherMove</identifier>
					<symbol>=</symbol>
					<expression>
						<term>
							<identifier>TicTacToeGame</identifier>
							<symbol>.</symbol>
							<identifier>getBestMove</identifier>
							<symbol>(</symbol>
							<expressionList>
								<expression>
									<term>
										<identifier>TicTacToeGame</identifier>
										<symbol>.</symbol>
										<identifier>getOtherPiece</identifier>
										<symbol>(</symbol>
										<expressionList>
											<expression>
												<term>
													<identifier>p</identifier>
												</term>
											</expression>
										</expressionList>
										<symbol>)</symbol>
									</term>
								</expression>
							</expressionList>
							<symbol>)</symbol>
						</term>
					</expression>
					<symbol>;</symbol>
				</letStatement>
				<letStatement>
					<keyword>let</keyword>
					<identifier>otherScore</identifier>
					<symbol>=</symbol>
					<expression>
						<term>
							<identifier>otherMove</identifier>
							<symbol>[</symbol>
							<expression>
								<term>
									<integerConstant>0</integerConstant>
								</term>
							</expression>
							<symbol>]</symbol>
						</term>
					</expression>
					<symbol>;</symbol>
				</letStatement>
				<doStatement>
					<keyword>do</keyword>
					<identifier>otherMove</identifier>
					<symbol>.</symbol>
					<identifier>dispose</identifier>
					<symbol>(</symbol>
					<expressionList>
</expressionList>
					<symbol>)</symbol>
					<symbol>;</symbol>
				</doStatement>
				<returnStatement>
					<keyword>return</keyword>
					<expression>
						<term>
							<symbol>-</symbol>
							<term>
								<identifier>otherScore</identifier>
							</term>
						</term>
					</expression>
					<symbol>;</symbol>
				</returnStatement>
			</statements>
			<symbol>}</symbol>
		</subroutineBody>
	</subroutineDec>
	<subroutineDec>
		<keyword>function</keyword>
		<keyword>int</keyword>
		<identifier>getOtherPiece</identifier>
		<symbol>(</symbol>
		<parameterList>
			<identifier>Piece</identifier>
			<identifier>p</identifier>
		</parameterList>
		<symbol>)</symbol>
		<subroutineBody>
			<symbol>{</symbol>
			<statements>
				<ifStatement>
					<keyword>if</keyword>
					<symbol>(</symbol>
					<expression>
						<term>
							<identifier>p</identifier>
						</term>
						<symbol>=</symbol>
						<term>
							<identifier>nPiece</identifier>
						</term>
					</expression>
					<symbol>)</symbol>
					<symbol>{</symbol>
					<statements>
						<returnStatement>
							<keyword>return</keyword>
							<expression>
								<term>
									<identifier>cPiece</identifier>
								</term>
							</expression>
							<symbol>;</symbol>
						</returnStatement>
					</statements>
					<symbol>}</symbol>
					<keyword>else</keyword>
					<symbol>{</symbol>
					<statements>
						<returnStatement>
							<keyword>return</keyword>
							<expression>
								<term>
									<identifier>nPiece</identifier>
								</term>
							</expression>
							<symbol>;</symbol>
						</returnStatement>
					</statements>
					<symbol>}</symbol>
				</ifStatement>
			</statements>
			<symbol>}</symbol>
		</subroutineBody>
	</subroutineDec>
	<subroutineDec>
		<keyword>function</keyword>
		<keyword>int</keyword>
		<identifier>getOtherPlayer</identifier>
		<symbol>(</symbol>
		<parameterList>
			<keyword>int</keyword>
			<identifier>p</identifier>
		</parameterList>
		<symbol>)</symbol>
		<subroutineBody>
			<symbol>{</symbol>
			<statements>
				<ifStatement>
					<keyword>if</keyword>
					<symbol>(</symbol>
					<expression>
						<term>
							<identifier>p</identifier>
						</term>
						<symbol>=</symbol>
						<term>
							<integerConstant>0</integerConstant>
						</term>
					</expression>
					<symbol>)</symbol>
					<symbol>{</symbol>
					<statements>
						<returnStatement>
							<keyword>return</keyword>
							<expression>
								<term>
									<integerConstant>1</integerConstant>
								</term>
							</expression>
							<symbol>;</symbol>
						</returnStatement>
					</statements>
					<symbol>}</symbol>
					<keyword>else</keyword>
					<symbol>{</symbol>
					<statements>
						<returnStatement>
							<keyword>return</keyword>
							<expression>
								<term>
									<integerConstant>0</integerConstant>
								</term>
							</expression>
							<symbol>;</symbol>
						</returnStatement>
					</statements>
					<symbol>}</symbol>
				</ifStatement>
			</statements>
			<symbol>}</symbol>
		</subroutineBody>
	</subroutineDec>
	<subroutineDec>
		<keyword>function</keyword>
		<identifier>Array</identifier>
		<identifier>getRandomGoodMove</identifier>
		<symbol>(</symbol>
		<parameterList>
</parameterList>
		<symbol>)</symbol>
		<subroutineBody>
			<symbol>{</symbol>
			<varDec>
				<keyword>var</keyword>
				<keyword>int</keyword>
				<identifier>v</identifier>
				<symbol>;</symbol>
			</varDec>
			<varDec>
				<keyword>var</keyword>
				<identifier>Array</identifier>
				<identifier>moves</identifier>
				<symbol>;</symbol>
			</varDec>
			<statements>
				<whileStatement>
					<keyword>while</keyword>
					<symbol>(</symbol>
					<expression>
						<term>
							<keyword>true</keyword>
						</term>
					</expression>
					<symbol>)</symbol>
					<symbol>{</symbol>
					<statements>
						<letStatement>
							<keyword>let</keyword>
							<identifier>v</identifier>
							<symbol>=</symbol>
							<expression>
								<term>
									<identifier>Random</identifier>
									<symbol>.</symbol>
									<identifier>randRange</identifier>
									<symbol>(</symbol>
									<expressionList>
										<expression>
											<term>
												<integerConstant>4</integerConstant>
											</term>
										</expression>
									</expressionList>
									<symbol>)</symbol>
								</term>
							</expression>
							<symbol>;</symbol>
						</letStatement>
						<letStatement>
							<keyword>let</keyword>
							<identifier>v</identifier>
							<symbol>=</symbol>
							<expression>
								<term>
									<symbol>(</symbol>
									<expression>
										<term>
											<identifier>v</identifier>
										</term>
										<symbol>*</symbol>
										<term>
											<integerConstant>2</integerConstant>
										</term>
									</expression>
									<symbol>)</symbol>
								</term>
								<symbol>+</symbol>
								<term>
									<integerConstant>1</integerConstant>
								</term>
							</expression>
							<symbol>;</symbol>
						</letStatement>
						<letStatement>
							<keyword>let</keyword>
							<identifier>moves</identifier>
							<symbol>=</symbol>
							<expression>
								<term>
									<identifier>TicTacToeGame</identifier>
									<symbol>.</symbol>
									<identifier>inputToMove</identifier>
									<symbol>(</symbol>
									<expressionList>
										<expression>
											<term>
												<identifier>v</identifier>
											</term>
										</expression>
									</expressionList>
									<symbol>)</symbol>
								</term>
							</expression>
							<symbol>;</symbol>
						</letStatement>
						<ifStatement>
							<keyword>if</keyword>
							<symbol>(</symbol>
							<expression>
								<term>
									<identifier>board</identifier>
									<symbol>.</symbol>
									<identifier>isFree</identifier>
									<symbol>(</symbol>
									<expressionList>
										<expression>
											<term>
												<identifier>moves</identifier>
												<symbol>[</symbol>
												<expression>
													<term>
														<integerConstant>0</integerConstant>
													</term>
												</expression>
												<symbol>]</symbol>
											</term>
										</expression>
										<symbol>,</symbol>
										<expression>
											<term>
												<identifier>moves</identifier>
												<symbol>[</symbol>
												<expression>
													<term>
														<integerConstant>1</integerConstant>
													</term>
												</expression>
												<symbol>]</symbol>
											</term>
										</expression>
									</expressionList>
									<symbol>)</symbol>
								</term>
							</expression>
							<symbol>)</symbol>
							<symbol>{</symbol>
							<statements>
								<returnStatement>
									<keyword>return</keyword>
									<expression>
										<term>
											<identifier>moves</identifier>
										</term>
									</expression>
									<symbol>;</symbol>
								</returnStatement>
							</statements>
							<symbol>}</symbol>
						</ifStatement>
					</statements>
					<symbol>}</symbol>
				</whileStatement>
				<returnStatement>
					<keyword>return</keyword>
					<expression>
						<term>
							<identifier>moves</identifier>
						</term>
					</expression>
					<symbol>;</symbol>
				</returnStatement>
			</statements>
			<symbol>}</symbol>
		</subroutineBody>
	</subroutineDec>
	<subroutineDec>
		<keyword>function</keyword>
		<identifier>Array</identifier>
		<identifier>getRandomMove</identifier>
		<symbol>(</symbol>
		<parameterList>
</parameterList>
		<symbol>)</symbol>
		<subroutineBody>
			<symbol>{</symbol>
			<varDec>
				<keyword>var</keyword>
				<keyword>int</keyword>
				<identifier>v</identifier>
				<symbol>;</symbol>
			</varDec>
			<varDec>
				<keyword>var</keyword>
				<identifier>Array</identifier>
				<identifier>moves</identifier>
				<symbol>;</symbol>
			</varDec>
			<statements>
				<whileStatement>
					<keyword>while</keyword>
					<symbol>(</symbol>
					<expression>
						<term>
							<keyword>true</keyword>
						</term>
					</expression>
					<symbol>)</symbol>
					<symbol>{</symbol>
					<statements>
						<letStatement>
							<keyword>let</keyword>
							<identifier>v</identifier>
							<symbol>=</symbol>
							<expression>
								<term>
									<identifier>Random</identifier>
									<symbol>.</symbol>
									<identifier>randRange</identifier>
									<symbol>(</symbol>
									<expressionList>
										<expression>
											<term>
												<integerConstant>8</integerConstant>
											</term>
										</expression>
									</expressionList>
									<symbol>)</symbol>
								</term>
								<symbol>+</symbol>
								<term>
									<integerConstant>1</integerConstant>
								</term>
							</expression>
							<symbol>;</symbol>
						</letStatement>
						<letStatement>
							<keyword>let</keyword>
							<identifier>moves</identifier>
							<symbol>=</symbol>
							<expression>
								<term>
									<identifier>TicTacToeGame</identifier>
									<symbol>.</symbol>
									<identifier>inputToMove</identifier>
									<symbol>(</symbol>
									<expressionList>
										<expression>
											<term>
												<identifier>v</identifier>
											</term>
										</expression>
									</expressionList>
									<symbol>)</symbol>
								</term>
							</expression>
							<symbol>;</symbol>
						</letStatement>
						<ifStatement>
							<keyword>if</keyword>
							<symbol>(</symbol>
							<expression>
								<term>
									<identifier>board</identifier>
									<symbol>.</symbol>
									<identifier>isFree</identifier>
									<symbol>(</symbol>
									<expressionList>
										<expression>
											<term>
												<identifier>moves</identifier>
												<symbol>[</symbol>
												<expression>
													<term>
														<integerConstant>0</integerConstant>
													</term>
												</expression>
												<symbol>]</symbol>
											</term>
										</expression>
										<symbol>,</symbol>
										<expression>
											<term>
												<identifier>moves</identifier>
												<symbol>[</symbol>
												<expression>
													<term>
														<integerConstant>1</integerConstant>
													</term>
												</expression>
												<symbol>]</symbol>
											</term>
										</expression>
									</expressionList>
									<symbol>)</symbol>
								</term>
							</expression>
							<symbol>)</symbol>
							<symbol>{</symbol>
							<statements>
								<returnStatement>
									<keyword>return</keyword>
									<expression>
										<term>
											<identifier>moves</identifier>
										</term>
									</expression>
									<symbol>;</symbol>
								</returnStatement>
							</statements>
							<symbol>}</symbol>
						</ifStatement>
					</statements>
					<symbol>}</symbol>
				</whileStatement>
				<returnStatement>
					<keyword>return</keyword>
					<expression>
						<term>
							<identifier>moves</identifier>
						</term>
					</expression>
					<symbol>;</symbol>
				</returnStatement>
			</statements>
			<symbol>}</symbol>
		</subroutineBody>
	</subroutineDec>
	<subroutineDec>
		<keyword>function</keyword>
		<identifier>Array</identifier>
		<identifier>inputToMove</identifier>
		<symbol>(</symbol>
		<parameterList>
			<keyword>int</keyword>
			<identifier>input</identifier>
		</parameterList>
		<symbol>)</symbol>
		<subroutineBody>
			<symbol>{</symbol>
			<varDec>
				<keyword>var</keyword>
				<identifier>Array</identifier>
				<identifier>moves</identifier>
				<symbol>;</symbol>
			</varDec>
			<statements>
				<letStatement>
					<keyword>let</keyword>
					<identifier>moves</identifier>
					<symbol>=</symbol>
					<expression>
						<term>
							<identifier>Array</identifier>
							<symbol>.</symbol>
							<identifier>new</identifier>
							<symbol>(</symbol>
							<expressionList>
								<expression>
									<term>
										<integerConstant>2</integerConstant>
									</term>
								</expression>
							</expressionList>
							<symbol>)</symbol>
						</term>
					</expression>
					<symbol>;</symbol>
				</letStatement>
				<letStatement>
					<keyword>let</keyword>
					<identifier>moves</identifier>
					<symbol>[</symbol>
					<expression>
						<term>
							<integerConstant>0</integerConstant>
						</term>
					</expression>
					<symbol>]</symbol>
					<symbol>=</symbol>
					<expression>
						<term>
							<symbol>(</symbol>
							<expression>
								<term>
									<identifier>input</identifier>
								</term>
								<symbol>-</symbol>
								<term>
									<integerConstant>1</integerConstant>
								</term>
							</expression>
							<symbol>)</symbol>
						</term>
						<symbol>/</symbol>
						<term>
							<integerConstant>3</integerConstant>
						</term>
					</expression>
					<symbol>;</symbol>
				</letStatement>
				<letStatement>
					<keyword>let</keyword>
					<identifier>moves</identifier>
					<symbol>[</symbol>
					<expression>
						<term>
							<integerConstant>1</integerConstant>
						</term>
					</expression>
					<symbol>]</symbol>
					<symbol>=</symbol>
					<expression>
						<term>
							<symbol>(</symbol>
							<expression>
								<term>
									<identifier>input</identifier>
								</term>
								<symbol>-</symbol>
								<term>
									<integerConstant>1</integerConstant>
								</term>
							</expression>
							<symbol>)</symbol>
						</term>
						<symbol>-</symbol>
						<term>
							<symbol>(</symbol>
							<expression>
								<term>
									<integerConstant>3</integerConstant>
								</term>
								<symbol>*</symbol>
								<term>
									<identifier>moves</identifier>
									<symbol>[</symbol>
									<expression>
										<term>
											<integerConstant>0</integerConstant>
										</term>
									</expression>
									<symbol>]</symbol>
								</term>
							</expression>
							<symbol>)</symbol>
						</term>
					</expression>
					<symbol>;</symbol>
				</letStatement>
				<returnStatement>
					<keyword>return</keyword>
					<expression>
						<term>
							<identifier>moves</identifier>
						</term>
					</expression>
					<symbol>;</symbol>
				</returnStatement>
			</statements>
			<symbol>}</symbol>
		</subroutineBody>
	</subroutineDec>
	<subroutineDec>
		<keyword>function</keyword>
		<keyword>void</keyword>
		<identifier>seedGame</identifier>
		<symbol>(</symbol>
		<parameterList>
</parameterList>
		<symbol>)</symbol>
		<subroutineBody>
			<symbol>{</symbol>
			<varDec>
				<keyword>var</keyword>
				<keyword>int</keyword>
				<identifier>seedCounter</identifier>
				<symbol>;</symbol>
			</varDec>
			<varDec>
				<keyword>var</keyword>
				<keyword>boolean</keyword>
				<identifier>enterPressed</identifier>
				<symbol>;</symbol>
			</varDec>
			<statements>
				<letStatement>
					<keyword>let</keyword>
					<identifier>enterPressed</identifier>
					<symbol>=</symbol>
					<expression>
						<term>
							<keyword>false</keyword>
						</term>
					</expression>
					<symbol>;</symbol>
				</letStatement>
				<letStatement>
					<keyword>let</keyword>
					<identifier>seedCounter</identifier>
					<symbol>=</symbol>
					<expression>
						<term>
							<integerConstant>1</integerConstant>
						</term>
					</expression>
					<symbol>;</symbol>
				</letStatement>
				<whileStatement>
					<keyword>while</keyword>
					<symbol>(</symbol>
					<expression>
						<term>
							<symbol>~</symbol>
							<term>
								<identifier>enterPressed</identifier>
							</term>
						</term>
					</expression>
					<symbol>)</symbol>
					<symbol>{</symbol>
					<statements>
						<ifStatement>
							<keyword>if</keyword>
							<symbol>(</symbol>
							<expression>
								<term>
									<identifier>Keyboard</identifier>
									<symbol>.</symbol>
									<identifier>keyPressed</identifier>
									<symbol>(</symbol>
									<expressionList>
</expressionList>
									<symbol>)</symbol>
								</term>
								<symbol>=</symbol>
								<term>
									<integerConstant>128</integerConstant>
								</term>
							</expression>
							<symbol>)</symbol>
							<symbol>{</symbol>
							<statements>
								<letStatement>
									<keyword>let</keyword>
									<identifier>enterPressed</identifier>
									<symbol>=</symbol>
									<expression>
										<term>
											<keyword>true</keyword>
										</term>
									</expression>
									<symbol>;</symbol>
								</letStatement>
							</statements>
							<symbol>}</symbol>
						</ifStatement>
						<letStatement>
							<keyword>let</keyword>
							<identifier>seedCounter</identifier>
							<symbol>=</symbol>
							<expression>
								<term>
									<identifier>seedCounter</identifier>
								</term>
								<symbol>+</symbol>
								<term>
									<integerConstant>1</integerConstant>
								</term>
							</expression>
							<symbol>;</symbol>
						</letStatement>
						<ifStatement>
							<keyword>if</keyword>
							<symbol>(</symbol>
							<expression>
								<term>
									<identifier>seedCounter</identifier>
								</term>
								<symbol>&gt;</symbol>
								<term>
									<integerConstant>25444</integerConstant>
								</term>
							</expression>
							<symbol>)</symbol>
							<symbol>{</symbol>
							<statements>
								<letStatement>
									<keyword>let</keyword>
									<identifier>seedCounter</identifier>
									<symbol>=</symbol>
									<expression>
										<term>
											<integerConstant>1</integerConstant>
										</term>
									</expression>
									<symbol>;</symbol>
								</letStatement>
							</statements>
							<symbol>}</symbol>
						</ifStatement>
					</statements>
					<symbol>}</symbol>
				</whileStatement>
				<doStatement>
					<keyword>do</keyword>
					<identifier>Random</identifier>
					<symbol>.</symbol>
					<identifier>setSeed</identifier>
					<symbol>(</symbol>
					<expressionList>
						<expression>
							<term>
								<identifier>seedCounter</identifier>
							</term>
						</expression>
					</expressionList>
					<symbol>)</symbol>
					<symbol>;</symbol>
				</doStatement>
				<returnStatement>
					<keyword>return</keyword>
					<symbol>;</symbol>
				</returnStatement>
			</statements>
			<symbol>}</symbol>
		</subroutineBody>
	</subroutineDec>
	<subroutineDec>
		<keyword>function</keyword>
		<keyword>void</keyword>
		<identifier>showCredits</identifier>
		<symbol>(</symbol>
		<parameterList>
</parameterList>
		<symbol>)</symbol>
		<subroutineBody>
			<symbol>{</symbol>
			<statements>
				<doStatement>
					<keyword>do</keyword>
					<identifier>Output</identifier>
					<symbol>.</symbol>
					<identifier>moveCursor</identifier>
					<symbol>(</symbol>
					<expressionList>
						<expression>
							<term>
								<integerConstant>20</integerConstant>
							</term>
						</expression>
						<symbol>,</symbol>
						<expression>
							<term>
								<integerConstant>16</integerConstant>
							</term>
						</expression>
					</expressionList>
					<symbol>)</symbol>
					<symbol>;</symbol>
				</doStatement>
				<doStatement>
					<keyword>do</keyword>
					<identifier>Output</identifier>
					<symbol>.</symbol>
					<identifier>printString</identifier>
					<symbol>(</symbol>
					<expressionList>
						<expression>
							<term>
								<stringConstant>Tic Tac Toe in Jack Language</stringConstant>
							</term>
						</expression>
					</expressionList>
					<symbol>)</symbol>
					<symbol>;</symbol>
				</doStatement>
				<doStatement>
					<keyword>do</keyword>
					<identifier>Output</identifier>
					<symbol>.</symbol>
					<identifier>moveCursor</identifier>
					<symbol>(</symbol>
					<expressionList>
						<expression>
							<term>
								<integerConstant>21</integerConstant>
							</term>
						</expression>
						<symbol>,</symbol>
						<expression>
							<term>
								<integerConstant>22</integerConstant>
							</term>
						</expression>
					</expressionList>
					<symbol>)</symbol>
					<symbol>;</symbol>
				</doStatement>
				<doStatement>
					<keyword>do</keyword>
					<identifier>Output</identifier>
					<symbol>.</symbol>
					<identifier>printString</identifier>
					<symbol>(</symbol>
					<expressionList>
						<expression>
							<term>
								<stringConstant>By Jayson Joseph</stringConstant>
							</term>
						</expression>
					</expressionList>
					<symbol>)</symbol>
					<symbol>;</symbol>
				</doStatement>
				<returnStatement>
					<keyword>return</keyword>
					<symbol>;</symbol>
				</returnStatement>
			</statements>
			<symbol>}</symbol>
		</subroutineBody>
	</subroutineDec>
	<symbol>}</symbol>
</class>
