order,table_schema,table_name,commentaire
1,chill_3party,party_category,Catégorie de tiers
2,chill_3party,party_center,Association entre les tiers et les centres (déprécié)
3,chill_3party,party_profession,Profession du tiers (déprécié)
4,chill_3party,third_party,Tiers
5,chill_3party,thirdparty_category,association tiers - catégories
6,chill_asideactivity,asideactivity,Activités annexes
7,chill_asideactivity,asideactivitycategory,Catégories d'activités annexes
8,chill_budget,charge,Charges du budget
9,chill_budget,charge_type,Types de charges
10,chill_budget,resource,Ressources du budget
11,chill_budget,resource_type,Types de ressources
12,chill_calendar,calendar,Rendez-vous
13,chill_calendar,calendar_doc,Document du rendez-vous
14,chill_calendar,calendar_range,Plage de disponibilité
15,chill_calendar,calendar_to_persons,association rendez-vous - usagers
16,chill_calendar,calendar_to_thirdparties,association rendez-vous - tiers
17,chill_calendar,cancel_reason,Motifs d'annulations
18,chill_calendar,invite,Invitation aux rendez-vous
19,chill_doc,accompanyingcourse_document,Documents associés aux parcours
20,chill_doc,document_category,Catégories de documents
21,chill_doc,person_document,Documents associés à l'usagers
22,chill_doc,stored_object,Documents
23,chill_task,recurring_task,Tâches récurrentes (non utilisé)
24,chill_task,single_task,Tâches
25,chill_task,single_task_place_event,Historique des transitions des tâches
26,chill_vendee,adressederelais,
27,chill_vendee,center_polygon
28,chill_vendee,entourage,
29,chill_vendee,geographical_unit
30,chill_vendee,geographical_unit_association
31,chill_vendee,mobilite
32,chill_vendee,niveauetude
33,chill_vendee,security_profile
34,chill_vendee,security_profile_action
35,chill_vendee,security_profile_jobs
36,chill_vendee,situationprofessionelle
37,chill_vendee,statutlogement
38,chill_vendee,tempsdetravail
39,chill_vendee,titredesejour
40,chill_vendee,vendee_person
41,chill_vendee,vendee_person_mineur
42,chill_vendee,vendeeperson_entourage
43,chill_vendee,vendeepersonmineur_adressederelais
44,public,accompanying_periods_scopes,Services associés aux parcours
45,public,activity,Échanges
46,public,activity_activityreason,s
47,public,activity_person,
48,public,activity_storedobject,
49,public,activity_thirdparty,
50,public,activity_user,
51,public,activityreason,Sujets d'échange
52,public,activityreasoncategory,Catégories de sujets
53,public,activitytpresence,Présence aux échanges
54,public,activitytype,Types d'échanges
55,public,activitytypecategory,Catégories de types d'échanges
56,public,centers,"Centres (territoires, agences, etc.)"
57,public,chill_activity_activity_chill_person_socialaction,
58,public,chill_activity_activity_chill_person_socialissue
59,public,chill_docgen_template,Gabarits de documents
60,public,chill_main_address,Adresses
61,public,chill_main_address_legacy,Anciennes adresses (dépréciés)
62,public,chill_main_address_reference,Adresses de référence
63,public,chill_main_civility,Civilités
64,public,chill_main_cronjob_execution,Dernière exécution des tâche cron
65,public,chill_main_geographical_unit,Unités géographiques
66,public,chill_main_geographical_unit_layer,Couches d'unités géographiques
67,public,chill_main_location,Localisations
68,public,chill_main_location_type,Types de localisations
69,public,chill_main_notification,Notifications
70,public,chill_main_notification_addresses_unread
71,public,chill_main_notification_addresses_user
72,public,chill_main_notification_comment,
73,public,chill_main_postal_code,Code postaux
74,public,chill_main_saved_export,Exports enregistrés
75,public,chill_main_user_job,Métiers
76,public,chill_main_workflow_entity,Workflows
77,public,chill_main_workflow_entity_comment
78,public,chill_main_workflow_entity_step,Etapes du workflow
79,public,chill_main_workflow_entity_step_cc_user,
80,public,chill_main_workflow_entity_step_user
81,public,chill_main_workflow_entity_step_user_by_accesskey,
82,public,chill_main_workflow_entity_subscriber_to_final,
83,public,chill_main_workflow_entity_subscriber_to_step
84,public,chill_person_accompanying_period,Parcours d'accompagnement
85,public,chill_person_accompanying_period_closingmotive,Motifs de cloture des parcours
86,public,chill_person_accompanying_period_comment,Commentaires des parcours
87,public,chill_person_accompanying_period_location_history,Historique de la localisatio ndes parcours
88,public,chill_person_accompanying_period_origin,Origine des parcours
89,public,chill_person_accompanying_period_participation,Appartenance des usagers au parcours
90,public,chill_person_accompanying_period_resource,Personnes ressources d'un parcours
91,public,chill_person_accompanying_period_social_issues,
92,public,chill_person_accompanying_period_step_history
93,public,chill_person_accompanying_period_user_history
94,public,chill_person_accompanying_period_work,Actions d'accompagnements
95,public,chill_person_accompanying_period_work_evaluation,Évaluations (dans les actions d'accompagnements)
96,public,chill_person_accompanying_period_work_evaluation_document,Documents des évaluations
97,public,chill_person_accompanying_period_work_goal,Objectifs d'une actions
98,public,chill_person_accompanying_period_work_goal_result,Objectifs et résultats d'une action
99,public,chill_person_accompanying_period_work_person,Usagers associés à une actions
100,public,chill_person_accompanying_period_work_referrer,Référents d'une actions
101,public,chill_person_accompanying_period_work_result,Résultats d'une action
102,public,chill_person_accompanying_period_work_third_party,Tiers traitants d'une action
103,public,chill_person_alt_name,"Noms supplémentaires d'un usager (nom marital, etc.)"
104,public,chill_person_household,Ménages
105,public,chill_person_household_composition,
106,public,chill_person_household_composition_type,Types de composition de ménage
107,public,chill_person_household_members,Membres du ménages
108,public,chill_person_household_position,Positions dans le ménage
109,public,chill_person_household_to_addresses,Association adresses - ménages
110,public,chill_person_marital_status,Etats civils
111,public,chill_person_not_duplicate,
112,public,chill_person_person,Usagers
113,public,chill_person_person_center_history,Historique des centres d'un usagers
114,public,chill_person_persons_to_addresses,Déprécié
115,public,chill_person_phone,Numéros d etéléphone supplémentaires d'un usager
116,public,chill_person_relations,Types de relations de filiation
117,public,chill_person_relationships,Relations de filiations
118,public,chill_person_residential_address,Adresses de résidences
119,public,chill_person_resource,Personnes ressources (pour les personnes)
120,public,chill_person_resource_kind,Type de personnes ressources
121,public,chill_person_social_action,Liste des actions d'accompagnement
122,public,chill_person_social_action_goal,Objectifs associés à une action
123,public,chill_person_social_action_result,Résultats associés à une action
124,public,chill_person_social_issue,Problématiques sociales
125,public,chill_person_social_work_evaluation,Evaluations disponibles
126,public,chill_person_social_work_evaluation_action,Associations entre les évaluations et les actions
127,public,chill_person_social_work_goal,Objectifs disponibles pour une actions
128,public,chill_person_social_work_goal_result,Objectifs et résultats disponible pour une action
129,public,chill_person_social_work_result,Résultats disponibles pour une action
130,public,country,Pays
131,public,custom_field_long_choice_options,
132,public,customfield
133,public,customfieldsdefaultgroup
134,public,customfieldsgroup
135,public,geography_columns,Table liée à postgis
136,public,geometry_columns,Table liée à postgis
137,public,group_centers,
138,public,language,Langues
139,public,messenger_messages,Table système
140,public,migration_versions,Table système
141,public,permission_groups
142,public,permissionsgroup_rolescope
143,public,persons_spoken_languages
144,public,regroupment,Regroupement de centres
145,public,regroupment_center,
146,public,role_scopes,
147,public,scopes,Services
148,public,spatial_ref_sys,Table système (postgis)
149,public,user_groupcenter,
150,public,users,Utilisateurs
151,public,view_chill_person_accompanying_period_info,
152,public,view_chill_person_current_address
153,public,view_chill_person_household_address
154,public,view_chill_person_person_center_history_current
