{
    "id": 2,
    "title": "Capitulo Dois",
    "description": "Segundo Capitulo de um Livro",
    "pageCount": 60,
    "excerpt": "Trecho retirado do Segundo Capitulo",
    "publishDate": "2021-03-15T01:44:01.736Z"
}