{
    "baseUrl": "https://fakerestapi.azurewebsites.net/api/v1/",
    "video": false,
    "watchForFileChanges": true,
    "experimentalSourceRewriting": false,
    "ignoreTestFiles": [
        "*.request.js",
        "*book*.json"
    ],
    "reporter": "cypress-multi-reporters",
    "reporterOptions": {
        "configFile": "reporter-config.json"
    }
}
