{
    "id": 1,
    "title": "Capitulo Um",
    "description": "Primeiro Capitulo de um Livro",
    "pageCount": 60,
    "excerpt": "Trecho retirado do Primeiro Capitulo",
    "publishDate": "2021-03-14T01:44:01.736Z"
}