%YAML 1.1
%TAG !u! tag:unity3d.com,2011:
--- !u!1001 &7384361825709983859
PrefabInstance:
  m_ObjectHideFlags: 0
  serializedVersion: 2
  m_Modification:
    m_TransformParent: {fileID: 0}
    m_Modifications:
    - target: {fileID: 3903941366898390445, guid: 5353eec965c4afc4dbde6d47bf0bc123, type: 3}
      propertyPath: m_Size.x
      value: 16
      objectReference: {fileID: 0}
    - target: {fileID: 3903941366898390445, guid: 5353eec965c4afc4dbde6d47bf0bc123, type: 3}
      propertyPath: m_Origin.x
      value: -8
      objectReference: {fileID: 0}
    - target: {fileID: 3903941366898390445, guid: 5353eec965c4afc4dbde6d47bf0bc123, type: 3}
      propertyPath: m_Tiles.Array.size
      value: 50
      objectReference: {fileID: 0}
    - target: {fileID: 3903941366898390445, guid: 5353eec965c4afc4dbde6d47bf0bc123, type: 3}
      propertyPath: m_Tiles.Array.data[0].first.x
      value: -8
      objectReference: {fileID: 0}
    - target: {fileID: 3903941366898390445, guid: 5353eec965c4afc4dbde6d47bf0bc123, type: 3}
      propertyPath: m_Tiles.Array.data[1].first.x
      value: -7
      objectReference: {fileID: 0}
    - target: {fileID: 3903941366898390445, guid: 5353eec965c4afc4dbde6d47bf0bc123, type: 3}
      propertyPath: m_Tiles.Array.data[2].first.x
      value: -6
      objectReference: {fileID: 0}
    - target: {fileID: 3903941366898390445, guid: 5353eec965c4afc4dbde6d47bf0bc123, type: 3}
      propertyPath: m_Tiles.Array.data[2].first.y
      value: -7
      objectReference: {fileID: 0}
    - target: {fileID: 3903941366898390445, guid: 5353eec965c4afc4dbde6d47bf0bc123, type: 3}
      propertyPath: m_Tiles.Array.data[3].first.x
      value: -5
      objectReference: {fileID: 0}
    - target: {fileID: 3903941366898390445, guid: 5353eec965c4afc4dbde6d47bf0bc123, type: 3}
      propertyPath: m_Tiles.Array.data[3].first.y
      value: -7
      objectReference: {fileID: 0}
    - target: {fileID: 3903941366898390445, guid: 5353eec965c4afc4dbde6d47bf0bc123, type: 3}
      propertyPath: m_Tiles.Array.data[4].first.x
      value: 0
      objectReference: {fileID: 0}
    - target: {fileID: 3903941366898390445, guid: 5353eec965c4afc4dbde6d47bf0bc123, type: 3}
      propertyPath: m_Tiles.Array.data[4].first.y
      value: -7
      objectReference: {fileID: 0}
    - target: {fileID: 3903941366898390445, guid: 5353eec965c4afc4dbde6d47bf0bc123, type: 3}
      propertyPath: m_Tiles.Array.data[5].first.x
      value: 1
      objectReference: {fileID: 0}
    - target: {fileID: 3903941366898390445, guid: 5353eec965c4afc4dbde6d47bf0bc123, type: 3}
      propertyPath: m_Tiles.Array.data[5].first.y
      value: -7
      objectReference: {fileID: 0}
    - target: {fileID: 3903941366898390445, guid: 5353eec965c4afc4dbde6d47bf0bc123, type: 3}
      propertyPath: m_Tiles.Array.data[6].first.x
      value: 2
      objectReference: {fileID: 0}
    - target: {fileID: 3903941366898390445, guid: 5353eec965c4afc4dbde6d47bf0bc123, type: 3}
      propertyPath: m_Tiles.Array.data[6].first.y
      value: -7
      objectReference: {fileID: 0}
    - target: {fileID: 3903941366898390445, guid: 5353eec965c4afc4dbde6d47bf0bc123, type: 3}
      propertyPath: m_Tiles.Array.data[7].first.x
      value: 3
      objectReference: {fileID: 0}
    - target: {fileID: 3903941366898390445, guid: 5353eec965c4afc4dbde6d47bf0bc123, type: 3}
      propertyPath: m_Tiles.Array.data[7].first.y
      value: -7
      objectReference: {fileID: 0}
    - target: {fileID: 3903941366898390445, guid: 5353eec965c4afc4dbde6d47bf0bc123, type: 3}
      propertyPath: m_Tiles.Array.data[8].first.x
      value: 4
      objectReference: {fileID: 0}
    - target: {fileID: 3903941366898390445, guid: 5353eec965c4afc4dbde6d47bf0bc123, type: 3}
      propertyPath: m_Tiles.Array.data[8].first.y
      value: -7
      objectReference: {fileID: 0}
    - target: {fileID: 3903941366898390445, guid: 5353eec965c4afc4dbde6d47bf0bc123, type: 3}
      propertyPath: m_Tiles.Array.data[9].first.x
      value: 5
      objectReference: {fileID: 0}
    - target: {fileID: 3903941366898390445, guid: 5353eec965c4afc4dbde6d47bf0bc123, type: 3}
      propertyPath: m_Tiles.Array.data[9].first.y
      value: -7
      objectReference: {fileID: 0}
    - target: {fileID: 3903941366898390445, guid: 5353eec965c4afc4dbde6d47bf0bc123, type: 3}
      propertyPath: m_Tiles.Array.data[10].first.x
      value: 6
      objectReference: {fileID: 0}
    - target: {fileID: 3903941366898390445, guid: 5353eec965c4afc4dbde6d47bf0bc123, type: 3}
      propertyPath: m_Tiles.Array.data[10].first.y
      value: -7
      objectReference: {fileID: 0}
    - target: {fileID: 3903941366898390445, guid: 5353eec965c4afc4dbde6d47bf0bc123, type: 3}
      propertyPath: m_Tiles.Array.data[11].first.x
      value: 7
      objectReference: {fileID: 0}
    - target: {fileID: 3903941366898390445, guid: 5353eec965c4afc4dbde6d47bf0bc123, type: 3}
      propertyPath: m_Tiles.Array.data[11].first.y
      value: -7
      objectReference: {fileID: 0}
    - target: {fileID: 3903941366898390445, guid: 5353eec965c4afc4dbde6d47bf0bc123, type: 3}
      propertyPath: m_Tiles.Array.data[12].first.x
      value: -8
      objectReference: {fileID: 0}
    - target: {fileID: 3903941366898390445, guid: 5353eec965c4afc4dbde6d47bf0bc123, type: 3}
      propertyPath: m_Tiles.Array.data[12].first.y
      value: -6
      objectReference: {fileID: 0}
    - target: {fileID: 3903941366898390445, guid: 5353eec965c4afc4dbde6d47bf0bc123, type: 3}
      propertyPath: m_Tiles.Array.data[13].first.x
      value: -7
      objectReference: {fileID: 0}
    - target: {fileID: 3903941366898390445, guid: 5353eec965c4afc4dbde6d47bf0bc123, type: 3}
      propertyPath: m_Tiles.Array.data[13].first.y
      value: -6
      objectReference: {fileID: 0}
    - target: {fileID: 3903941366898390445, guid: 5353eec965c4afc4dbde6d47bf0bc123, type: 3}
      propertyPath: m_Tiles.Array.data[14].first.x
      value: -6
      objectReference: {fileID: 0}
    - target: {fileID: 3903941366898390445, guid: 5353eec965c4afc4dbde6d47bf0bc123, type: 3}
      propertyPath: m_Tiles.Array.data[14].first.y
      value: -6
      objectReference: {fileID: 0}
    - target: {fileID: 3903941366898390445, guid: 5353eec965c4afc4dbde6d47bf0bc123, type: 3}
      propertyPath: m_Tiles.Array.data[15].first.x
      value: -5
      objectReference: {fileID: 0}
    - target: {fileID: 3903941366898390445, guid: 5353eec965c4afc4dbde6d47bf0bc123, type: 3}
      propertyPath: m_Tiles.Array.data[15].first.y
      value: -6
      objectReference: {fileID: 0}
    - target: {fileID: 3903941366898390445, guid: 5353eec965c4afc4dbde6d47bf0bc123, type: 3}
      propertyPath: m_Tiles.Array.data[16].first.x
      value: 0
      objectReference: {fileID: 0}
    - target: {fileID: 3903941366898390445, guid: 5353eec965c4afc4dbde6d47bf0bc123, type: 3}
      propertyPath: m_Tiles.Array.data[16].first.y
      value: -6
      objectReference: {fileID: 0}
    - target: {fileID: 3903941366898390445, guid: 5353eec965c4afc4dbde6d47bf0bc123, type: 3}
      propertyPath: m_Tiles.Array.data[17].first.x
      value: 1
      objectReference: {fileID: 0}
    - target: {fileID: 3903941366898390445, guid: 5353eec965c4afc4dbde6d47bf0bc123, type: 3}
      propertyPath: m_Tiles.Array.data[17].first.y
      value: -6
      objectReference: {fileID: 0}
    - target: {fileID: 3903941366898390445, guid: 5353eec965c4afc4dbde6d47bf0bc123, type: 3}
      propertyPath: m_Tiles.Array.data[18].first.x
      value: 2
      objectReference: {fileID: 0}
    - target: {fileID: 3903941366898390445, guid: 5353eec965c4afc4dbde6d47bf0bc123, type: 3}
      propertyPath: m_Tiles.Array.data[18].first.y
      value: -6
      objectReference: {fileID: 0}
    - target: {fileID: 3903941366898390445, guid: 5353eec965c4afc4dbde6d47bf0bc123, type: 3}
      propertyPath: m_Tiles.Array.data[19].first.x
      value: 3
      objectReference: {fileID: 0}
    - target: {fileID: 3903941366898390445, guid: 5353eec965c4afc4dbde6d47bf0bc123, type: 3}
      propertyPath: m_Tiles.Array.data[19].first.y
      value: -6
      objectReference: {fileID: 0}
    - target: {fileID: 3903941366898390445, guid: 5353eec965c4afc4dbde6d47bf0bc123, type: 3}
      propertyPath: m_Tiles.Array.data[20].first.x
      value: 4
      objectReference: {fileID: 0}
    - target: {fileID: 3903941366898390445, guid: 5353eec965c4afc4dbde6d47bf0bc123, type: 3}
      propertyPath: m_Tiles.Array.data[20].first.y
      value: -6
      objectReference: {fileID: 0}
    - target: {fileID: 3903941366898390445, guid: 5353eec965c4afc4dbde6d47bf0bc123, type: 3}
      propertyPath: m_Tiles.Array.data[21].first.x
      value: 5
      objectReference: {fileID: 0}
    - target: {fileID: 3903941366898390445, guid: 5353eec965c4afc4dbde6d47bf0bc123, type: 3}
      propertyPath: m_Tiles.Array.data[21].first.y
      value: -6
      objectReference: {fileID: 0}
    - target: {fileID: 3903941366898390445, guid: 5353eec965c4afc4dbde6d47bf0bc123, type: 3}
      propertyPath: m_Tiles.Array.data[22].first.x
      value: 6
      objectReference: {fileID: 0}
    - target: {fileID: 3903941366898390445, guid: 5353eec965c4afc4dbde6d47bf0bc123, type: 3}
      propertyPath: m_Tiles.Array.data[22].first.y
      value: -6
      objectReference: {fileID: 0}
    - target: {fileID: 3903941366898390445, guid: 5353eec965c4afc4dbde6d47bf0bc123, type: 3}
      propertyPath: m_Tiles.Array.data[23].first.x
      value: 7
      objectReference: {fileID: 0}
    - target: {fileID: 3903941366898390445, guid: 5353eec965c4afc4dbde6d47bf0bc123, type: 3}
      propertyPath: m_Tiles.Array.data[23].first.y
      value: -6
      objectReference: {fileID: 0}
    - target: {fileID: 3903941366898390445, guid: 5353eec965c4afc4dbde6d47bf0bc123, type: 3}
      propertyPath: m_Tiles.Array.data[24].first.x
      value: -8
      objectReference: {fileID: 0}
    - target: {fileID: 3903941366898390445, guid: 5353eec965c4afc4dbde6d47bf0bc123, type: 3}
      propertyPath: m_Tiles.Array.data[24].first.y
      value: -5
      objectReference: {fileID: 0}
    - target: {fileID: 3903941366898390445, guid: 5353eec965c4afc4dbde6d47bf0bc123, type: 3}
      propertyPath: m_Tiles.Array.data[25].first.x
      value: -7
      objectReference: {fileID: 0}
    - target: {fileID: 3903941366898390445, guid: 5353eec965c4afc4dbde6d47bf0bc123, type: 3}
      propertyPath: m_Tiles.Array.data[25].first.y
      value: -5
      objectReference: {fileID: 0}
    - target: {fileID: 3903941366898390445, guid: 5353eec965c4afc4dbde6d47bf0bc123, type: 3}
      propertyPath: m_Tiles.Array.data[26].first.x
      value: -6
      objectReference: {fileID: 0}
    - target: {fileID: 3903941366898390445, guid: 5353eec965c4afc4dbde6d47bf0bc123, type: 3}
      propertyPath: m_Tiles.Array.data[26].first.y
      value: -5
      objectReference: {fileID: 0}
    - target: {fileID: 3903941366898390445, guid: 5353eec965c4afc4dbde6d47bf0bc123, type: 3}
      propertyPath: m_Tiles.Array.data[27].first.x
      value: -5
      objectReference: {fileID: 0}
    - target: {fileID: 3903941366898390445, guid: 5353eec965c4afc4dbde6d47bf0bc123, type: 3}
      propertyPath: m_Tiles.Array.data[27].first.y
      value: -5
      objectReference: {fileID: 0}
    - target: {fileID: 3903941366898390445, guid: 5353eec965c4afc4dbde6d47bf0bc123, type: 3}
      propertyPath: m_Tiles.Array.data[28].first.x
      value: 0
      objectReference: {fileID: 0}
    - target: {fileID: 3903941366898390445, guid: 5353eec965c4afc4dbde6d47bf0bc123, type: 3}
      propertyPath: m_Tiles.Array.data[28].first.y
      value: -5
      objectReference: {fileID: 0}
    - target: {fileID: 3903941366898390445, guid: 5353eec965c4afc4dbde6d47bf0bc123, type: 3}
      propertyPath: m_Tiles.Array.data[29].first.x
      value: 1
      objectReference: {fileID: 0}
    - target: {fileID: 3903941366898390445, guid: 5353eec965c4afc4dbde6d47bf0bc123, type: 3}
      propertyPath: m_Tiles.Array.data[29].first.y
      value: -5
      objectReference: {fileID: 0}
    - target: {fileID: 3903941366898390445, guid: 5353eec965c4afc4dbde6d47bf0bc123, type: 3}
      propertyPath: m_Tiles.Array.data[30].first.x
      value: 2
      objectReference: {fileID: 0}
    - target: {fileID: 3903941366898390445, guid: 5353eec965c4afc4dbde6d47bf0bc123, type: 3}
      propertyPath: m_Tiles.Array.data[30].first.y
      value: -5
      objectReference: {fileID: 0}
    - target: {fileID: 3903941366898390445, guid: 5353eec965c4afc4dbde6d47bf0bc123, type: 3}
      propertyPath: m_Tiles.Array.data[31].first.x
      value: 3
      objectReference: {fileID: 0}
    - target: {fileID: 3903941366898390445, guid: 5353eec965c4afc4dbde6d47bf0bc123, type: 3}
      propertyPath: m_Tiles.Array.data[31].first.y
      value: -5
      objectReference: {fileID: 0}
    - target: {fileID: 3903941366898390445, guid: 5353eec965c4afc4dbde6d47bf0bc123, type: 3}
      propertyPath: m_Tiles.Array.data[32].first.x
      value: 4
      objectReference: {fileID: 0}
    - target: {fileID: 3903941366898390445, guid: 5353eec965c4afc4dbde6d47bf0bc123, type: 3}
      propertyPath: m_Tiles.Array.data[32].first.y
      value: -5
      objectReference: {fileID: 0}
    - target: {fileID: 3903941366898390445, guid: 5353eec965c4afc4dbde6d47bf0bc123, type: 3}
      propertyPath: m_Tiles.Array.data[33].first.x
      value: 5
      objectReference: {fileID: 0}
    - target: {fileID: 3903941366898390445, guid: 5353eec965c4afc4dbde6d47bf0bc123, type: 3}
      propertyPath: m_Tiles.Array.data[33].first.y
      value: -5
      objectReference: {fileID: 0}
    - target: {fileID: 3903941366898390445, guid: 5353eec965c4afc4dbde6d47bf0bc123, type: 3}
      propertyPath: m_Tiles.Array.data[34].first.x
      value: 6
      objectReference: {fileID: 0}
    - target: {fileID: 3903941366898390445, guid: 5353eec965c4afc4dbde6d47bf0bc123, type: 3}
      propertyPath: m_Tiles.Array.data[34].first.y
      value: -5
      objectReference: {fileID: 0}
    - target: {fileID: 3903941366898390445, guid: 5353eec965c4afc4dbde6d47bf0bc123, type: 3}
      propertyPath: m_Tiles.Array.data[35].first.x
      value: 7
      objectReference: {fileID: 0}
    - target: {fileID: 3903941366898390445, guid: 5353eec965c4afc4dbde6d47bf0bc123, type: 3}
      propertyPath: m_Tiles.Array.data[35].first.y
      value: -5
      objectReference: {fileID: 0}
    - target: {fileID: 3903941366898390445, guid: 5353eec965c4afc4dbde6d47bf0bc123, type: 3}
      propertyPath: m_Tiles.Array.data[36].first.x
      value: -8
      objectReference: {fileID: 0}
    - target: {fileID: 3903941366898390445, guid: 5353eec965c4afc4dbde6d47bf0bc123, type: 3}
      propertyPath: m_Tiles.Array.data[36].first.y
      value: -4
      objectReference: {fileID: 0}
    - target: {fileID: 3903941366898390445, guid: 5353eec965c4afc4dbde6d47bf0bc123, type: 3}
      propertyPath: m_Tiles.Array.data[37].first.x
      value: -7
      objectReference: {fileID: 0}
    - target: {fileID: 3903941366898390445, guid: 5353eec965c4afc4dbde6d47bf0bc123, type: 3}
      propertyPath: m_Tiles.Array.data[37].first.y
      value: -4
      objectReference: {fileID: 0}
    - target: {fileID: 3903941366898390445, guid: 5353eec965c4afc4dbde6d47bf0bc123, type: 3}
      propertyPath: m_Tiles.Array.data[38].first.x
      value: -6
      objectReference: {fileID: 0}
    - target: {fileID: 3903941366898390445, guid: 5353eec965c4afc4dbde6d47bf0bc123, type: 3}
      propertyPath: m_Tiles.Array.data[38].first.y
      value: -4
      objectReference: {fileID: 0}
    - target: {fileID: 3903941366898390445, guid: 5353eec965c4afc4dbde6d47bf0bc123, type: 3}
      propertyPath: m_Tiles.Array.data[39].first.x
      value: -5
      objectReference: {fileID: 0}
    - target: {fileID: 3903941366898390445, guid: 5353eec965c4afc4dbde6d47bf0bc123, type: 3}
      propertyPath: m_Tiles.Array.data[39].first.y
      value: -4
      objectReference: {fileID: 0}
    - target: {fileID: 3903941366898390445, guid: 5353eec965c4afc4dbde6d47bf0bc123, type: 3}
      propertyPath: m_Tiles.Array.data[40].first.x
      value: 0
      objectReference: {fileID: 0}
    - target: {fileID: 3903941366898390445, guid: 5353eec965c4afc4dbde6d47bf0bc123, type: 3}
      propertyPath: m_Tiles.Array.data[40].first.y
      value: -4
      objectReference: {fileID: 0}
    - target: {fileID: 3903941366898390445, guid: 5353eec965c4afc4dbde6d47bf0bc123, type: 3}
      propertyPath: m_Tiles.Array.data[41].first.x
      value: 1
      objectReference: {fileID: 0}
    - target: {fileID: 3903941366898390445, guid: 5353eec965c4afc4dbde6d47bf0bc123, type: 3}
      propertyPath: m_Tiles.Array.data[41].first.y
      value: -4
      objectReference: {fileID: 0}
    - target: {fileID: 3903941366898390445, guid: 5353eec965c4afc4dbde6d47bf0bc123, type: 3}
      propertyPath: m_Tiles.Array.data[42].first.x
      value: 2
      objectReference: {fileID: 0}
    - target: {fileID: 3903941366898390445, guid: 5353eec965c4afc4dbde6d47bf0bc123, type: 3}
      propertyPath: m_Tiles.Array.data[42].first.y
      value: -4
      objectReference: {fileID: 0}
    - target: {fileID: 3903941366898390445, guid: 5353eec965c4afc4dbde6d47bf0bc123, type: 3}
      propertyPath: m_Tiles.Array.data[43].first.x
      value: 3
      objectReference: {fileID: 0}
    - target: {fileID: 3903941366898390445, guid: 5353eec965c4afc4dbde6d47bf0bc123, type: 3}
      propertyPath: m_Tiles.Array.data[43].first.y
      value: -4
      objectReference: {fileID: 0}
    - target: {fileID: 3903941366898390445, guid: 5353eec965c4afc4dbde6d47bf0bc123, type: 3}
      propertyPath: m_Tiles.Array.data[44].first.x
      value: 4
      objectReference: {fileID: 0}
    - target: {fileID: 3903941366898390445, guid: 5353eec965c4afc4dbde6d47bf0bc123, type: 3}
      propertyPath: m_Tiles.Array.data[44].first.y
      value: -4
      objectReference: {fileID: 0}
    - target: {fileID: 3903941366898390445, guid: 5353eec965c4afc4dbde6d47bf0bc123, type: 3}
      propertyPath: m_Tiles.Array.data[45].first.x
      value: 5
      objectReference: {fileID: 0}
    - target: {fileID: 3903941366898390445, guid: 5353eec965c4afc4dbde6d47bf0bc123, type: 3}
      propertyPath: m_Tiles.Array.data[45].first.y
      value: -4
      objectReference: {fileID: 0}
    - target: {fileID: 3903941366898390445, guid: 5353eec965c4afc4dbde6d47bf0bc123, type: 3}
      propertyPath: m_Tiles.Array.data[46].first.x
      value: 6
      objectReference: {fileID: 0}
    - target: {fileID: 3903941366898390445, guid: 5353eec965c4afc4dbde6d47bf0bc123, type: 3}
      propertyPath: m_Tiles.Array.data[46].first.y
      value: -4
      objectReference: {fileID: 0}
    - target: {fileID: 3903941366898390445, guid: 5353eec965c4afc4dbde6d47bf0bc123, type: 3}
      propertyPath: m_Tiles.Array.data[47].first.y
      value: -4
      objectReference: {fileID: 0}
    - target: {fileID: 3903941366898390445, guid: 5353eec965c4afc4dbde6d47bf0bc123, type: 3}
      propertyPath: m_Tiles.Array.data[48].first.x
      value: -6
      objectReference: {fileID: 0}
    - target: {fileID: 3903941366898390445, guid: 5353eec965c4afc4dbde6d47bf0bc123, type: 3}
      propertyPath: m_Tiles.Array.data[48].first.y
      value: -2
      objectReference: {fileID: 0}
    - target: {fileID: 3903941366898390445, guid: 5353eec965c4afc4dbde6d47bf0bc123, type: 3}
      propertyPath: m_Tiles.Array.data[49].first.x
      value: 5
      objectReference: {fileID: 0}
    - target: {fileID: 3903941366898390445, guid: 5353eec965c4afc4dbde6d47bf0bc123, type: 3}
      propertyPath: m_Tiles.Array.data[49].first.y
      value: -2
      objectReference: {fileID: 0}
    - target: {fileID: 3903941366898390445, guid: 5353eec965c4afc4dbde6d47bf0bc123, type: 3}
      propertyPath: m_TileAssetArray.Array.data[0].m_RefCount
      value: 5
      objectReference: {fileID: 0}
    - target: {fileID: 3903941366898390445, guid: 5353eec965c4afc4dbde6d47bf0bc123, type: 3}
      propertyPath: m_TileAssetArray.Array.data[1].m_RefCount
      value: 109
      objectReference: {fileID: 0}
    - target: {fileID: 3903941366898390445, guid: 5353eec965c4afc4dbde6d47bf0bc123, type: 3}
      propertyPath: m_TileColorArray.Array.data[0].m_RefCount
      value: 50
      objectReference: {fileID: 0}
    - target: {fileID: 3903941366898390445, guid: 5353eec965c4afc4dbde6d47bf0bc123, type: 3}
      propertyPath: m_Tiles.Array.data[48].second.m_TileIndex
      value: 0
      objectReference: {fileID: 0}
    - target: {fileID: 3903941366898390445, guid: 5353eec965c4afc4dbde6d47bf0bc123, type: 3}
      propertyPath: m_Tiles.Array.data[49].second.m_TileIndex
      value: 0
      objectReference: {fileID: 0}
    - target: {fileID: 3903941366898390445, guid: 5353eec965c4afc4dbde6d47bf0bc123, type: 3}
      propertyPath: m_TileMatrixArray.Array.data[0].m_RefCount
      value: 50
      objectReference: {fileID: 0}
    - target: {fileID: 3903941366898390445, guid: 5353eec965c4afc4dbde6d47bf0bc123, type: 3}
      propertyPath: m_TileSpriteArray.Array.data[0].m_RefCount
      value: 5
      objectReference: {fileID: 0}
    - target: {fileID: 3903941366898390445, guid: 5353eec965c4afc4dbde6d47bf0bc123, type: 3}
      propertyPath: m_TileSpriteArray.Array.data[1].m_RefCount
      value: 109
      objectReference: {fileID: 0}
    - target: {fileID: 3903941366898390445, guid: 5353eec965c4afc4dbde6d47bf0bc123, type: 3}
      propertyPath: m_Tiles.Array.data[2].second.m_AllTileFlags
      value: 1073741825
      objectReference: {fileID: 0}
    - target: {fileID: 3903941366898390445, guid: 5353eec965c4afc4dbde6d47bf0bc123, type: 3}
      propertyPath: m_Tiles.Array.data[48].second.m_TileSpriteIndex
      value: 0
      objectReference: {fileID: 0}
    - target: {fileID: 3903941366898390445, guid: 5353eec965c4afc4dbde6d47bf0bc123, type: 3}
      propertyPath: m_Tiles.Array.data[49].second.m_TileSpriteIndex
      value: 0
      objectReference: {fileID: 0}
    - target: {fileID: 3903941366898390445, guid: 5353eec965c4afc4dbde6d47bf0bc123, type: 3}
      propertyPath: m_Tiles.Array.data[2].second.m_TileObjectToInstantiateIndex
      value: 65535
      objectReference: {fileID: 0}
    - target: {fileID: 7803938182487028989, guid: 5353eec965c4afc4dbde6d47bf0bc123, type: 3}
      propertyPath: m_Name
      value: Ground Template 2
      objectReference: {fileID: 0}
    - target: {fileID: 7803938182487028991, guid: 5353eec965c4afc4dbde6d47bf0bc123, type: 3}
      propertyPath: m_RootOrder
      value: 0
      objectReference: {fileID: 0}
    - target: {fileID: 7803938182487028991, guid: 5353eec965c4afc4dbde6d47bf0bc123, type: 3}
      propertyPath: m_LocalPosition.x
      value: 0
      objectReference: {fileID: 0}
    - target: {fileID: 7803938182487028991, guid: 5353eec965c4afc4dbde6d47bf0bc123, type: 3}
      propertyPath: m_LocalPosition.y
      value: 0
      objectReference: {fileID: 0}
    - target: {fileID: 7803938182487028991, guid: 5353eec965c4afc4dbde6d47bf0bc123, type: 3}
      propertyPath: m_LocalPosition.z
      value: 0
      objectReference: {fileID: 0}
    - target: {fileID: 7803938182487028991, guid: 5353eec965c4afc4dbde6d47bf0bc123, type: 3}
      propertyPath: m_LocalRotation.w
      value: 1
      objectReference: {fileID: 0}
    - target: {fileID: 7803938182487028991, guid: 5353eec965c4afc4dbde6d47bf0bc123, type: 3}
      propertyPath: m_LocalRotation.x
      value: 0
      objectReference: {fileID: 0}
    - target: {fileID: 7803938182487028991, guid: 5353eec965c4afc4dbde6d47bf0bc123, type: 3}
      propertyPath: m_LocalRotation.y
      value: 0
      objectReference: {fileID: 0}
    - target: {fileID: 7803938182487028991, guid: 5353eec965c4afc4dbde6d47bf0bc123, type: 3}
      propertyPath: m_LocalRotation.z
      value: 0
      objectReference: {fileID: 0}
    - target: {fileID: 7803938182487028991, guid: 5353eec965c4afc4dbde6d47bf0bc123, type: 3}
      propertyPath: m_LocalEulerAnglesHint.x
      value: 0
      objectReference: {fileID: 0}
    - target: {fileID: 7803938182487028991, guid: 5353eec965c4afc4dbde6d47bf0bc123, type: 3}
      propertyPath: m_LocalEulerAnglesHint.y
      value: 0
      objectReference: {fileID: 0}
    - target: {fileID: 7803938182487028991, guid: 5353eec965c4afc4dbde6d47bf0bc123, type: 3}
      propertyPath: m_LocalEulerAnglesHint.z
      value: 0
      objectReference: {fileID: 0}
    - target: {fileID: 7803938183512476415, guid: 5353eec965c4afc4dbde6d47bf0bc123, type: 3}
      propertyPath: m_Tiles.Array.size
      value: 12
      objectReference: {fileID: 0}
    - target: {fileID: 7803938183512476415, guid: 5353eec965c4afc4dbde6d47bf0bc123, type: 3}
      propertyPath: m_Tiles.Array.data[4].first.x
      value: 0
      objectReference: {fileID: 0}
    - target: {fileID: 7803938183512476415, guid: 5353eec965c4afc4dbde6d47bf0bc123, type: 3}
      propertyPath: m_Tiles.Array.data[5].first.x
      value: 1
      objectReference: {fileID: 0}
    - target: {fileID: 7803938183512476415, guid: 5353eec965c4afc4dbde6d47bf0bc123, type: 3}
      propertyPath: m_Tiles.Array.data[6].first.x
      value: 2
      objectReference: {fileID: 0}
    - target: {fileID: 7803938183512476415, guid: 5353eec965c4afc4dbde6d47bf0bc123, type: 3}
      propertyPath: m_Tiles.Array.data[7].first.x
      value: 3
      objectReference: {fileID: 0}
    - target: {fileID: 7803938183512476415, guid: 5353eec965c4afc4dbde6d47bf0bc123, type: 3}
      propertyPath: m_Tiles.Array.data[8].first.x
      value: 4
      objectReference: {fileID: 0}
    - target: {fileID: 7803938183512476415, guid: 5353eec965c4afc4dbde6d47bf0bc123, type: 3}
      propertyPath: m_Tiles.Array.data[9].first.x
      value: 5
      objectReference: {fileID: 0}
    - target: {fileID: 7803938183512476415, guid: 5353eec965c4afc4dbde6d47bf0bc123, type: 3}
      propertyPath: m_Tiles.Array.data[10].first.x
      value: 6
      objectReference: {fileID: 0}
    - target: {fileID: 7803938183512476415, guid: 5353eec965c4afc4dbde6d47bf0bc123, type: 3}
      propertyPath: m_Tiles.Array.data[11].first.x
      value: 7
      objectReference: {fileID: 0}
    - target: {fileID: 7803938183512476415, guid: 5353eec965c4afc4dbde6d47bf0bc123, type: 3}
      propertyPath: m_Tiles.Array.data[12].first.x
      value: 7
      objectReference: {fileID: 0}
    - target: {fileID: 7803938183512476415, guid: 5353eec965c4afc4dbde6d47bf0bc123, type: 3}
      propertyPath: m_Tiles.Array.data[13].first.x
      value: 7
      objectReference: {fileID: 0}
    - target: {fileID: 7803938183512476415, guid: 5353eec965c4afc4dbde6d47bf0bc123, type: 3}
      propertyPath: m_Tiles.Array.data[14].first.x
      value: 7
      objectReference: {fileID: 0}
    - target: {fileID: 7803938183512476415, guid: 5353eec965c4afc4dbde6d47bf0bc123, type: 3}
      propertyPath: m_TileAssetArray.Array.data[0].m_RefCount
      value: 12
      objectReference: {fileID: 0}
    - target: {fileID: 7803938183512476415, guid: 5353eec965c4afc4dbde6d47bf0bc123, type: 3}
      propertyPath: m_TileColorArray.Array.data[0].m_RefCount
      value: 12
      objectReference: {fileID: 0}
    - target: {fileID: 7803938183512476415, guid: 5353eec965c4afc4dbde6d47bf0bc123, type: 3}
      propertyPath: m_TileMatrixArray.Array.data[0].m_RefCount
      value: 12
      objectReference: {fileID: 0}
    - target: {fileID: 7803938183512476415, guid: 5353eec965c4afc4dbde6d47bf0bc123, type: 3}
      propertyPath: m_TileSpriteArray.Array.data[0].m_RefCount
      value: 12
      objectReference: {fileID: 0}
    m_RemovedComponents: []
  m_SourcePrefab: {fileID: 100100000, guid: 5353eec965c4afc4dbde6d47bf0bc123, type: 3}
