Division,WeightClassKg,Place,Name,Team,BodyweightKg,Best3SquatKg,Best3BenchKg,Best3DeadliftKg,TotalKg,Equipment,Event,Sex,BirthDate
Boys,51.71,1,Eric Broussard,Tuscola Jim Ned,50.62,115.67,77.11,127.01,319.78,Single-ply,SBD,M,
Boys,51.71,2,Joseph Hester,Abilene,51.62,95.25,56.7,102.06,254.01,Single-ply,SBD,M,
Boys,51.71,3,Nick Garcia #1,Abilene,50.62,88.45,47.63,92.99,229.06,Single-ply,SBD,M,
Boys,51.71,4,Jathan Sheridan,Roscoe Collegiate,48.99,65.77,52.16,92.99,210.92,Single-ply,SBD,M,
Boys,55.79,1,Adrian Garcia,Roby,55.61,124.74,77.11,129.27,331.12,Single-ply,SBD,M,
Boys,55.79,2,Wyatt Kofoed,Merkel,53.52,117.93,63.5,138.35,319.78,Single-ply,SBD,M,
Boys,55.79,3,Jacob Miller-Covington,Clyde,53.25,117.93,56.7,138.35,312.98,Single-ply,SBD,M,
Boys,55.79,4,Christian Rodriquez,Tuscola Jim Ned,53.25,108.86,63.5,120.2,292.57,Single-ply,SBD,M,
Boys,59.87,1,Tristen Thompson,Merkel,58.6,172.37,106.59,172.37,451.32,Single-ply,SBD,M,
Boys,59.87,2,Chase Idhe,Tuscola Jim Ned,58.15,104.33,56.7,111.13,272.16,Single-ply,SBD,M,
Boys,67.13,1,Canaan Charleston,Clyde,60.87,206.38,136.08,192.78,535.24,Single-ply,SBD,M,
Boys,67.13,2,Jessus Menjivar,Abilene Cooper,64.95,197.31,108.86,199.58,505.76,Single-ply,SBD,M,
Boys,67.13,3,D'Alan Cotton,Merkel,67.09,158.76,90.72,176.9,426.38,Single-ply,SBD,M,
Boys,67.13,4,Don Bridges,Tuscola Jim Ned,66.86,154.22,77.11,176.9,408.23,Single-ply,SBD,M,
Boys,67.13,5,Andrew Bradley,Abilene Cooper,63.32,151.95,83.91,165.56,401.43,Single-ply,SBD,M,
Boys,67.13,6,Oscar Montoya,Merkel,63.05,151.95,81.65,147.42,381.02,Single-ply,SBD,M,
Boys,67.13,7,Tony Leyva,Merkel,61.78,136.08,90.72,151.95,378.75,Single-ply,SBD,M,
Boys,67.13,8,Jackson Myers,Merkel,61.73,147.42,83.91,145.15,376.48,Single-ply,SBD,M,
Boys,67.13,9,Marc Williams,Haskell,63.23,129.27,77.11,151.95,358.34,Single-ply,SBD,M,
Boys,67.13,10,Cam Herron,Abilene Cooper,61.14,136.08,72.57,136.08,344.73,Single-ply,SBD,M,
Boys,67.13,11,Rhett Bingham,Clyde,66.95,113.4,68.04,145.15,326.59,Single-ply,SBD,M,
Boys,67.13,DQ,Alex Carey,Hawley,67.13,151.95,,,,Single-ply,SBD,M,
Boys,67.13,DQ,Ethan Estes,Tuscola Jim Ned,67.13,138.35,,,,Single-ply,SBD,M,
Boys,67.13,DQ,Matthew Richard,Anson,62.14,,,,,Single-ply,SBD,M,
Boys,74.84,1,Jesse Pete,Stamford,71.21,190.51,113.4,195.04,498.95,Single-ply,SBD,M,
Boys,74.84,2,Artem Brendle,Haskell,71.12,158.76,97.52,183.7,439.98,Single-ply,SBD,M,
Boys,74.84,3,Raul Gamez,Abilene Cooper,72.3,158.76,104.33,170.1,433.18,Single-ply,SBD,M,
Boys,74.84,4,Tyler Mansker,Abilene Cooper,74.3,158.76,92.99,181.44,433.18,Single-ply,SBD,M,
Boys,74.84,5,Luke Leonard,Haskell,73.66,158.76,102.06,165.56,426.38,Single-ply,SBD,M,
Boys,74.84,6,Mark Leyva,Merkel,72.85,136.08,77.11,156.49,369.68,Single-ply,SBD,M,
Boys,74.84,7,Evan Mier,Merkel,68.04,138.35,61.23,131.54,331.12,Single-ply,SBD,M,
Boys,74.84,DQ,Ramiro Aguilar,Hawley,69.13,167.83,,,,Single-ply,SBD,M,
Boys,82.1,1,Richard Hoffman,Clyde,75.84,213.19,111.13,188.24,512.56,Single-ply,SBD,M,
Boys,82.1,2,Johnathan Vanwinkle,Abilene Cooper,79.2,183.7,99.79,197.31,480.81,Single-ply,SBD,M,
Boys,82.1,3,Jacob Childers,Clyde,79.83,174.63,97.52,181.44,453.59,Single-ply,SBD,M,
Boys,82.1,4,Caleb Wright,Haskell,79.02,183.7,92.99,174.63,451.32,Single-ply,SBD,M,
Boys,82.1,5,Sam Meier,Roscoe Collegiate,77.66,151.95,97.52,185.97,435.45,Single-ply,SBD,M,
Boys,82.1,6,John Powell,Clyde,80.29,138.35,99.79,138.35,376.48,Single-ply,SBD,M,
Boys,82.1,7,Eddie Poen,Clyde,76.66,124.74,90.72,154.22,369.68,Single-ply,SBD,M,
Boys,89.81,1,Donovan Gomez,Clyde,88.99,251.74,163.29,242.67,657.71,Single-ply,SBD,M,
Boys,89.81,2,Emile Niyonkuru,Abilene Cooper,83.19,222.26,133.81,213.19,569.26,Single-ply,SBD,M,
Boys,89.81,3,Jacob Deax,Abilene Cooper,86.36,206.38,122.47,219.99,548.85,Single-ply,SBD,M,
Boys,89.81,4,Elijah Dudley,Clyde,89.27,188.24,115.67,199.58,503.49,Single-ply,SBD,M,
Boys,89.81,5,Tyler Stevens,Tuscola Jim Ned,87.36,167.83,102.06,197.31,467.2,Single-ply,SBD,M,
Boys,89.81,6,Kobe Martinez,Hawley,89.18,181.44,104.33,167.83,453.59,Single-ply,SBD,M,
Boys,89.81,7,Shawn Howell,Roby,84.28,167.83,92.99,167.83,428.64,Single-ply,SBD,M,
Boys,89.81,8,Adan Navarette,Merkel,89.72,163.29,86.18,170.1,419.57,Single-ply,SBD,M,
Boys,89.81,9,Cooper Wheat,Haskell,89.45,154.22,99.79,156.49,410.5,Single-ply,SBD,M,
Boys,89.81,10,Johnnie Ward,Stamford,82.19,158.76,79.38,142.88,381.02,Single-ply,SBD,M,
Boys,89.81,11,Lucus Moreno,Hawley,84.1,124.74,77.11,124.74,326.59,Single-ply,SBD,M,
Boys,99.79,1,Phillip McDowell,Clyde,94.89,244.94,156.49,233.6,635.03,Single-ply,SBD,M,
Boys,99.79,2,Adam Keidl,Clyde,94.03,206.38,136.08,226.8,569.26,Single-ply,SBD,M,
Boys,99.79,3,Jon Fish,Clyde,96.89,181.44,120.2,192.78,494.42,Single-ply,SBD,M,
Boys,99.79,4,Ryan Johnson #19,Abilene,98.07,185.97,95.25,172.37,453.59,Single-ply,SBD,M,
Boys,99.79,5,Jayden Weaver,Haskell,97.34,149.69,90.72,181.44,421.84,Single-ply,SBD,M,
Boys,99.79,6,Morgan Bryan,Clyde,89.9,156.49,95.25,167.83,419.57,Single-ply,SBD,M,
Boys,99.79,7,Wyatt Southerland,Abilene,92.53,147.42,77.11,151.95,376.48,Single-ply,SBD,M,
Boys,99.79,DQ,Arthur Murillo,Tuscola Jim Ned,93.08,251.74,,,,Single-ply,SBD,M,
Boys,99.79,DQ,Caleb Moreno,Anson,94.3,,,,,Single-ply,SBD,M,
Boys,109.77,1,Dylan Worgull,Abilene,103.6,222.26,131.54,213.19,566.99,Single-ply,SBD,M,
Boys,109.77,2,Morgan Porter,Clyde,105.78,197.31,124.74,197.31,519.36,Single-ply,SBD,M,
Boys,109.77,3,Steven Covasos,Stamford,109.77,163.29,90.72,163.29,417.3,Single-ply,SBD,M,
Boys,109.77,4,Gustavo Velasquez,Clyde,100.88,161.03,92.99,156.49,410.5,Single-ply,SBD,M,
Boys,109.77,5,Diego Vela,Roscoe Collegiate,107.32,142.88,111.13,129.27,383.29,Single-ply,SBD,M,
Boys,124.74,1,Gatlyn Cooper,Tuscola Jim Ned,123.2,201.85,113.4,238.14,553.38,Single-ply,SBD,M,
Boys,124.74,2,Julian Garcia,Abilene,115.03,229.06,136.08,185.97,551.11,Single-ply,SBD,M,
Boys,124.74,3,Brayden Flores,Abilene Cooper,118.39,213.19,124.74,190.51,528.44,Single-ply,SBD,M,
Boys,124.74,4,Zach Killam,Abilene,112.31,210.92,95.25,183.7,489.88,Single-ply,SBD,M,
Boys,124.74,5,Steven Crain,Haskell,123.65,170.1,104.33,174.63,449.06,Single-ply,SBD,M,
Boys,124.74,6,Ian Moreno,Roby,116.94,165.56,108.86,165.56,439.98,Single-ply,SBD,M,
Boys,124.74,7,Ben Gomez,Abilene,110.31,181.44,79.38,170.1,430.91,Single-ply,SBD,M,
Boys,124.74,8,Jakoby Castro,Stamford,124.74,172.37,86.18,170.1,428.64,Single-ply,SBD,M,
Boys,124.74,9,Xavier Lopez,Roscoe Collegiate,121.38,179.17,92.99,149.69,421.84,Single-ply,SBD,M,
Boys,124.74,10,Dakota Rodriguez,Haskell,114.94,145.15,70.31,163.29,378.75,Single-ply,SBD,M,
Boys,124.74+,1,Stedham Buchanan,Clyde,126.55,240.4,176.9,229.06,646.37,Single-ply,SBD,M,
Boys,124.74+,2,Jaime Rodriguez,Abilene,129.36,240.4,131.54,204.12,576.06,Single-ply,SBD,M,
Boys,124.74+,3,Jaxon O'Kelly,Merkel,136.53,229.06,136.08,192.78,557.92,Single-ply,SBD,M,
Boys,124.74+,4,Daniel Salazar,Abilene Cooper,128.82,219.99,142.88,183.7,546.58,Single-ply,SBD,M,
Boys,124.74+,5,Camron Price,Clyde,126.28,197.31,111.13,206.38,514.83,Single-ply,SBD,M,
Boys,124.74+,6,Wesley Schowengerdt,Clyde,128.82,179.17,111.13,179.17,469.47,Single-ply,SBD,M,
Boys,124.74+,DQ,Wesley Estridge,Albany,146.51,294.84,,,,Single-ply,SBD,M,
Boys,,NS,Tyler Guelker,Roscoe Collegiate,,,,,,Single-ply,SBD,M,
Boys,,NS,Jake Gonzales,Roscoe Collegiate,,,,,,Single-ply,SBD,M,
Boys,,NS,Khalil Spivey,Abilene,,,,,,Single-ply,SBD,M,
Boys,,NS,Matthew Lozano,Anson,,,,,,Single-ply,SBD,M,
Boys,,NS,Isaac Brann,Anson,,,,,,Single-ply,SBD,M,
Boys,,NS,Dawson Cannon,Clyde,,,,,,Single-ply,SBD,M,
Boys,,NS,Zachary Hoffman,Clyde,,,,,,Single-ply,SBD,M,
Boys,,NS,Kade Miller,Hawley,,,,,,Single-ply,SBD,M,
Boys,,NS,Caleb Sutton,Hawley,,,,,,Single-ply,SBD,M,
Boys,,NS,Jacobe Moore,Abilene Cooper,,,,,,Single-ply,SBD,M,
Boys,,NS,James Griffin,Abilene Cooper,,,,,,Single-ply,SBD,M,
Boys,,NS,Ezekial Chavez,Abilene,,,,,,Single-ply,SBD,M,
Boys,,NS,Hez Parker,Hawley,,,,,,Single-ply,SBD,M,
Boys,,NS,Cody Farley,Abilene Cooper,,,,,,Single-ply,SBD,M,
Boys,,NS,Austin Escobar,Merkel,,,,,,Single-ply,SBD,M,
Boys,,NS,Roberto Hernandez,Abilene Cooper,,,,,,Single-ply,SBD,M,
Boys,,NS,Allen Garcia,Abilene Cooper,,,,,,Single-ply,SBD,M,
Boys,,NS,Truett Ekdahl,Stamford,,,,,,Single-ply,SBD,M,
Boys,,NS,Aaron Duran,Stamford,,,,,,Single-ply,SBD,M,
Boys,,NS,Tristen Payne,Haskell,,,,,,Single-ply,SBD,M,
Boys,,NS,Xavier Soliz,Anson,,,,,,Single-ply,SBD,M,
Boys,,NS,Joe Galvan,Anson,,,,,,Single-ply,SBD,M,
Boys,,NS,Cruz Cantu,Stamford,,,,,,Single-ply,SBD,M,
Boys,,NS,Trace Thruman,Stamford,,,,,,Single-ply,SBD,M,
Boys,,NS,Jeremiah Quesonoz,Stamford,,,,,,Single-ply,SBD,M,
