Name,Age,Division,Equipment,Sex,BodyweightKg,WeightClassKg,Bench1Kg,Bench2Kg,Bench3Kg,Best3BenchKg,Deadlift1Kg,Deadlift2Kg,Deadlift3Kg,Best3DeadliftKg,TotalKg,Place,Country,Event,BirthDate
Moritz Wagner,27,Open,Raw,M,89.9,90,160,170,-180,170,,,,,170,1,Germany,B,
Taishi Kanamaru,33,Open,Raw,M,81,82.5,-150,150,-160,150,,,,,150,2,Germany,B,
Lukas Luft,36,Open,Raw,M,79.1,82.5,130,135,140,140,,,,,140,3,Germany,B,
Mirko Klatt,42,M-1,Raw,M,88.7,90,142.5,-145,-145,142.5,,,,,142.5,4,Germany,B,
Thien Nguyen,27,Open,Raw,M,77.3,82.5,120,127.5,-132.5,127.5,,,,,127.5,5,Germany,B,
Mostafa Daoud,33,Open,Raw,M,71.1,75,110,120,-125,120,,,,,120,6,Germany,B,
Mika Steinhauser,18,T-2,Raw,M,80.8,82.5,115,120,125,125,,,,,125,7,Germany,B,
Felix Pawlak,31,Open,Raw,M,79.7,82.5,105,115,120,120,,,,,120,8,Germany,B,
Felix Notz,21,Jun,Raw,M,77.2,82.5,100,105,110,110,,,,,110,9,Germany,B,
Alex Bleier,23,Jun,Raw,M,89.6,90,115,-122.5,-122.5,115,,,,,115,10,Germany,B,
Ravi Rothermund,27,Open,Raw,M,74.8,75,95,100,-102.5,100,,,,,100,11,Germany,B,
Jörg Rödiger,56,M-4,Raw,M,88.8,90,95,105,110,110,,,,,110,12,Germany,B,
Aaron Biebel,17,T-2,Raw,M,78.7,82.5,-95,95,-102.5,95,,,,,95,13,Germany,B,
Daniel Gref,25,Open,Raw,M,80.1,82.5,85,90,95,95,,,,,95,14,Germany,B,
Sophie Sträb,29,Open,Raw,F,59.9,60,65,70,72.5,72.5,,,,,72.5,1,Germany,B,
Switlana Medinkov,49,M-2,Raw,F,60.6,67.5,60,-65,67.5,67.5,,,,,67.5,2,Germany,B,
Anna Eden,21,Jun,Raw,F,77.8,82.5,55,65,-70,65,,,,,65,3,Germany,B,
Hanna Goldbach,18,T-2,Raw,F,69.9,75,50,55,60,60,,,,,60,4,Germany,B,
Cassandra Keller,20,Jun,Raw,F,62.4,67.5,45,50,55,55,,,,,55,5,Germany,B,
Theresa Rühle,21,Jun,Raw,F,49.1,52,42.5,45,-50,45,,,,,45,6,Germany,B,
Elisa Blesin,20,Jun,Raw,F,59,60,45,50,-52.5,50,,,,,50,7,Germany,B,
Jamie Friedrich,22,Jun,Raw,F,71.3,75,45,50,-60,50,,,,,50,8,Germany,B,
Petra Hoffmann,42,M-1,Single-ply,F,143.2,90+,110,120,130,130,,,,,130,1,Germany,B,
Thomas Godesberg,40,M-1,Raw,M,127.1,140,190,210,225,225,,,,,225,1,Germany,B,
Deniz Kedikov,54,M-3,Raw,M,151.3,140+,200,-210,-210,200,,,,,200,2,Germany,B,
Lutz Suntrup,30,Open,Raw,M,105,110,165,175,182.5,182.5,,,,,182.5,3,Germany,B,
Dejan Peric,28,Open,Raw,M,101.3,110,170,180,-187.5,180,,,,,180,4,Germany,B,
Guido Schlemmer,41,M-1,Raw,M,96.7,100,170,-175,,170,,,,,170,5,Germany,B,
Wladimir Bleer,36,Open,Raw,M,96.1,100,152.5,-160,162.5,162.5,,,,,162.5,6,Germany,B,
Sebastian Hug,31,Open,Raw,M,99.2,100,155,160,-162.5,160,,,,,160,7,Germany,B,
Florian Förster,42,M-1,Raw,M,135.1,140,150,165,170,170,,,,,170,8,Germany,B,
Michael Freider,43,M-1,Raw,M,118.7,125,140,150,160,160,,,,,160,9,Germany,B,
Benjamin Ehret,29,Open,Raw,M,95,100,127.5,132.5,137.5,137.5,,,,,137.5,10,Germany,B,
Yannik Koch,32,Open,Raw,M,96.6,100,135,-140,-140,135,,,,,135,11,Germany,B,
Martin Kries,36,Open,Multi-ply,M,106.5,110,-300,320,335,335,,,,,335,1,Germany,B,
Peter Malfa,59,M-4,Multi-ply,M,99.7,100,150,165,-172.5,165,,,,,165,2,Germany,B,
Mostafa Daoud,33,Open,Raw,M,71.1,75,,,,,210,220,227.5,227.5,227.5,1,Germany,D,
Sven Fischer,27,Open,Raw,M,80.9,82.5,,,,,190,210,225,225,225,2,Germany,D,
Sven Brey,23,Jun,Raw,M,76.8,82.5,,,,,180,200,210,210,210,3,Germany,D,
Mika Steinhauser,18,T-2,Raw,M,80.8,82.5,,,,,210,215,-222.5,215,215,4,Germany,D,
Johannes Vogl,22,Jun,Raw,M,81.3,82.5,,,,,190,200,215,215,215,5,Germany,D,
Lucas John,25,Open,Raw,M,89.2,90,,,,,205,225,-240,225,225,6,Germany,D,
Lukas Luft,36,Open,Raw,M,79.1,82.5,,,,,190,200,207.5,207.5,207.5,7,Germany,D,
Felix Pawlak,31,Open,Raw,M,79.7,82.5,,,,,185,197.5,205,205,205,8,Germany,D,
Thien Nguyen,27,Open,Raw,M,77.3,82.5,,,,,180,190,200,200,200,9,Germany,D,
Marvin Degen,21,Jun,Raw,M,61.3,67.5,,,,,147.5,157.5,162.5,162.5,162.5,10,Germany,D,
Stefan Wiedenbein,45,M-2,Raw,M,82.6,90,,,,,180,200,-205,200,200,11,Germany,D,
Felix Notz,21,Jun,Raw,M,77.2,82.5,,,,,170,180,185,185,185,12,Germany,D,
Alex Bleier,23,Jun,Raw,M,89.6,90,,,,,180,195,-205,195,195,13,Germany,D,
Aaron Biebel,17,T-2,Raw,M,78.7,82.5,,,,,170,180,-185,180,180,14,Germany,D,
Poppy,19,T-2,Raw,M,79,82.5,,,,,120,150,180,180,180,15,Germany,D,
Daniel Gref,25,Open,Raw,M,80.1,82.5,,,,,145,160,170,170,170,16,Germany,D,
Ravi Rothermund,27,Open,Raw,M,74.8,75,,,,,120,130,-140,130,130,17,Germany,D,
Sophie Sträb,29,Open,Raw,F,59.9,60,,,,,140,150,-155,150,150,1,Germany,D,
Anna Eden,21,Jun,Raw,F,77.8,82.5,,,,,150,160,170,170,170,2,Germany,D,
Ulrike Ertl,63,M-5,Raw,F,72.8,75,,,,,140,150,160,160,160,3,Germany,D,
Theresa Rühle,21,Jun,Raw,F,49.1,52,,,,,90,100,105,105,105,4,Germany,D,
Cassandra Keller,20,Jun,Raw,F,62.4,67.5,,,,,112.5,120,125,125,125,5,Germany,D,
Elisa Blesin,20,Jun,Raw,F,59,60,,,,,102.5,110,115,115,115,6,Germany,D,
Jamie Friedrich,22,Jun,Raw,F,71.3,75,,,,,110,120,130,130,130,7,Germany,D,
Petra Hoffmann,42,M-1,Raw,F,143.2,90+,,,,,120,140,155,155,155,8,Germany,D,
Briska Cech,65,M-6,Raw,F,98.5,90+,,,,,80,90,100,100,100,9,Germany,D,
Guido Schlemmer,41,M-1,Raw,M,96.7,100,,,,,270,285,-295,285,285,1,Germany,D,
Matheusz Volk,29,Open,Raw,M,114.8,125,,,,,250,275,302.5,302.5,302.5,2,Germany,D,
Andreas Minuth,28,Open,Raw,M,129.3,140,,,,,275,300,310,310,310,3,Germany,D,
Patrick Ohleff,41,M-1,Raw,M,133.7,140,,,,,275,300,305,305,305,4,Germany,D,
Christian Poppe,42,M-1,Raw,M,123.3,125,,,,,230,280,300,300,300,5,Germany,D,
Johannes Pfeffer,24,Open,Raw,M,102.5,110,,,,,220,230,240,240,240,6,Germany,D,
Deniz Kedikov,54,M-3,Raw,M,151.3,140+,,,,,260,-300,-300,260,260,7,Germany,D,
Johannes Fiedler,19,T-2,Raw,M,104,110,,,,,202.5,217.5,235,235,235,8,Germany,D,
Sebastian Hug,31,Open,Raw,M,99.2,100,,,,,220,230,-235,230,230,9,Germany,D,
Martin Thusbaß,58,M-4,Raw,M,107.1,110,,,,,200,220,235,235,235,10,Germany,D,
Max Brunner,26,Open,Raw,M,120.9,125,,,,,230,235,240,240,240,11,Germany,D,
Florian Förster,42,M-1,Raw,M,135.1,140,,,,,230,237.5,245,245,245,12,Germany,D,
Benjamin Ehret,29,Open,Raw,M,95,100,,,,,205,210,-220,210,210,13,Germany,D,
Michael Porer,54,M-3,Raw,M,99.9,100,,,,,190,200,210,210,210,14,Germany,D,
Reinhold Blüml,50,M-3,Single-ply,M,98,100,,,,,240,260,280,280,280,1,Germany,D,
Tobias Brandl,28,Open,Single-ply,M,79.9,82.5,,,,,210,230,250,250,250,2,Germany,D,
Alexander Dotzler,37,Open,Single-ply,M,101,110,,,,,240,260,270,270,270,3,Germany,D,
Sepp Maurer,44,M-1,Single-ply,M,116.1,125,,,,,240,260,280,280,280,4,Germany,D,
Dominik Hoppe,40,M-1,Single-ply,M,115,125,,,,,250,265,-275,265,265,5,Germany,D,
Peter Malfa,59,M-4,Single-ply,M,99.7,100,,,,,200,215,225,225,225,6,Germany,D,
Alexander Gerth,29,Open,Multi-ply,M,142.5,140+,,,,,270,300,320,320,320,1,Germany,D,
