{
  "codigoFinalizacao": "0000",
  "eleitores": [
    {
      "Id": "1234",
      "Nome": "Eleitor A"
    },
    {
      "Id": "5678",
      "Nome": "Eleitor B"
    },
    {
      "Id": "9012",
      "Nome": "Eleitor B"
    }
  ],
  "lanches": [
    {
      "Id": "11",
      "Nome": "Hamburguer"
    },
    {
      "Id": "22",
      "Nome": "Pizza"
    },
    {
      "Id": "33",
      "Nome": "Pastel"
    }
  ],
  "bebidas": [
    {
      "Id": "444",
      "Nome": "Refrigerante"
    },
    {
      "Id": "777",
      "Nome": "Suco"
    },
    {
      "Id": "999",
      "Nome": "Água"
    }
  ]
}
