[
{"name": "2013 Вересень", "url": "http://ilnlicey.ucoz.ua/news/2013-09"},
{"name": "2013 Листопад", "url": "http://ilnlicey.ucoz.ua/news/2013-11"},
{"name": "2014 Серпень", "url": "http://ilnlicey.ucoz.ua/news/2014-08"},
{"name": "2014 Вересень", "url": "http://ilnlicey.ucoz.ua/news/2014-09"},
{"name": "2014 Жовтень", "url": "http://ilnlicey.ucoz.ua/news/2014-10"},
{"name": "2014 Листопад", "url": "http://ilnlicey.ucoz.ua/news/2014-11"},
{"name": "2014 Грудень", "url": "http://ilnlicey.ucoz.ua/news/2014-12"},
{"name": "2015 Січень", "url": "http://ilnlicey.ucoz.ua/news/2015-01"},
{"name": "2015 Лютий", "url": "http://ilnlicey.ucoz.ua/news/2015-02"},
{"name": "2015 Березень", "url": "http://ilnlicey.ucoz.ua/news/2015-03"},
{"name": "2015 Квітень", "url": "http://ilnlicey.ucoz.ua/news/2015-04"},
{"name": "2015 Травень", "url": "http://ilnlicey.ucoz.ua/news/2015-05"},
{"name": "2015 Червень", "url": "http://ilnlicey.ucoz.ua/news/2015-06"},
{"name": "2015 Липень", "url": "http://ilnlicey.ucoz.ua/news/2015-07"},
{"name": "2015 Серпень", "url": "http://ilnlicey.ucoz.ua/news/2015-08"},
{"name": "2015 Вересень", "url": "http://ilnlicey.ucoz.ua/news/2015-09"},
{"name": "2015 Жовтень", "url": "http://ilnlicey.ucoz.ua/news/2015-10"},
{"name": "2015 Листопад", "url": "http://ilnlicey.ucoz.ua/news/2015-11"},
{"name": "2015 Грудень", "url": "http://ilnlicey.ucoz.ua/news/2015-12"},
{"name": "2016 Січень", "url": "http://ilnlicey.ucoz.ua/news/2016-01"},
{"name": "2016 Лютий", "url": "http://ilnlicey.ucoz.ua/news/2016-02"},
{"name": "2016 Березень", "url": "http://ilnlicey.ucoz.ua/news/2016-03"},
{"name": "2016 Квітень", "url": "http://ilnlicey.ucoz.ua/news/2016-04"},
{"name": "2016 Травень", "url": "http://ilnlicey.ucoz.ua/news/2016-05"},
{"name": "2016 Червень", "url": "http://ilnlicey.ucoz.ua/news/2016-06"},
{"name": "2016 Липень", "url": "http://ilnlicey.ucoz.ua/news/2016-07"},
{"name": "2016 Серпень", "url": "http://ilnlicey.ucoz.ua/news/2016-08"},
{"name": "2016 Вересень", "url": "http://ilnlicey.ucoz.ua/news/2016-09"},
{"name": "2016 Жовтень", "url": "http://ilnlicey.ucoz.ua/news/2016-10"},
{"name": "2016 Листопад", "url": "http://ilnlicey.ucoz.ua/news/2016-11"},
{"name": "2016 Грудень", "url": "http://ilnlicey.ucoz.ua/news/2016-12"},
{"name": "2017 Січень", "url": "http://ilnlicey.ucoz.ua/news/2017-01"},
{"name": "2017 Лютий", "url": "http://ilnlicey.ucoz.ua/news/2017-02"},
{"name": "2017 Березень", "url": "http://ilnlicey.ucoz.ua/news/2017-03"},
{"name": "2017 Квітень", "url": "http://ilnlicey.ucoz.ua/news/2017-04"},
{"name": "2017 Травень", "url": "http://ilnlicey.ucoz.ua/news/2017-05"},
{"name": "2017 Червень", "url": "http://ilnlicey.ucoz.ua/news/2017-06"},
{"name": "2017 Серпень", "url": "http://ilnlicey.ucoz.ua/news/2017-08"},
{"name": "2017 Вересень", "url": "http://ilnlicey.ucoz.ua/news/2017-09"},
{"name": "2017 Жовтень", "url": "http://ilnlicey.ucoz.ua/news/2017-10"},
{"name": "2017 Листопад", "url": "http://ilnlicey.ucoz.ua/news/2017-11"},
{"name": "2017 Грудень", "url": "http://ilnlicey.ucoz.ua/news/2017-12"},
{"name": "2018 Січень", "url": "http://ilnlicey.ucoz.ua/news/2018-01"},
{"name": "2018 Лютий", "url": "http://ilnlicey.ucoz.ua/news/2018-02"},
{"name": "2018 Березень", "url": "http://ilnlicey.ucoz.ua/news/2018-03"},
{"name": "2018 Квітень", "url": "http://ilnlicey.ucoz.ua/news/2018-04"},
{"name": "2018 Травень", "url": "http://ilnlicey.ucoz.ua/news/2018-05"},
{"name": "2018 Червень", "url": "http://ilnlicey.ucoz.ua/news/2018-06"},
{"name": "2018 Липень", "url": "http://ilnlicey.ucoz.ua/news/2018-07"},
{"name": "2018 Серпень", "url": "http://ilnlicey.ucoz.ua/news/2018-08"},
{"name": "2018 Вересень", "url": "http://ilnlicey.ucoz.ua/news/2018-09"},
{"name": "2018 Жовтень", "url": "http://ilnlicey.ucoz.ua/news/2018-10"},
{"name": "2018 Листопад", "url": "http://ilnlicey.ucoz.ua/news/2018-11"},
{"name": "2018 Грудень", "url": "http://ilnlicey.ucoz.ua/news/2018-12"},
{"name": "2019 Січень", "url": "http://ilnlicey.ucoz.ua/news/2019-01"},
{"name": "2019 Лютий", "url": "http://ilnlicey.ucoz.ua/news/2019-02"},
{"name": "2019 Березень", "url": "http://ilnlicey.ucoz.ua/news/2019-03"},
{"name": "2019 Квітень", "url": "http://ilnlicey.ucoz.ua/news/2019-04"},
{"name": "2019 Травень", "url": "http://ilnlicey.ucoz.ua/news/2019-05"},
{"name": "2019 Червень", "url": "http://ilnlicey.ucoz.ua/news/2019-06"},
{"name": "2019 Серпень", "url": "http://ilnlicey.ucoz.ua/news/2019-08"},
{"name": "2019 Вересень", "url": "http://ilnlicey.ucoz.ua/news/2019-09"},
{"name": "2019 Жовтень", "url": "http://ilnlicey.ucoz.ua/news/2019-10"},
{"name": "2019 Листопад", "url": "http://ilnlicey.ucoz.ua/news/2019-11"},
{"name": "2019 Грудень", "url": "http://ilnlicey.ucoz.ua/news/2019-12"},
{"name": "2020 Січень", "url": "http://ilnlicey.ucoz.ua/news/2020-01"},
{"name": "2020 Лютий", "url": "http://ilnlicey.ucoz.ua/news/2020-02"},
{"name": "2020 Березень", "url": "http://ilnlicey.ucoz.ua/news/2020-03"},
{"name": "2020 Квітень", "url": "http://ilnlicey.ucoz.ua/news/2020-04"},
{"name": "2020 Травень", "url": "http://ilnlicey.ucoz.ua/news/2020-05"},
{"name": "2020 Червень", "url": "http://ilnlicey.ucoz.ua/news/2020-06"},
{"name": "2020 Серпень", "url": "http://ilnlicey.ucoz.ua/news/2020-08"},
{"name": "2020 Вересень", "url": "http://ilnlicey.ucoz.ua/news/2020-09"},
{"name": "2020 Жовтень", "url": "http://ilnlicey.ucoz.ua/news/2020-10"},
{"name": "2020 Листопад", "url": "http://ilnlicey.ucoz.ua/news/2020-11"},
{"name": "2020 Грудень", "url": "http://ilnlicey.ucoz.ua/news/2020-12"},
{"name": "2021 Січень", "url": "http://ilnlicey.ucoz.ua/news/2021-01"},
{"name": "2021 Лютий", "url": "http://ilnlicey.ucoz.ua/news/2021-02"},
{"name": "2021 Березень", "url": "http://ilnlicey.ucoz.ua/news/2021-03"},
{"name": "2021 Квітень", "url": "http://ilnlicey.ucoz.ua/news/2021-04"},
{"name": "2021 Травень", "url": "http://ilnlicey.ucoz.ua/news/2021-05"},
{"name": "2021 Червень", "url": "http://ilnlicey.ucoz.ua/news/2021-06"},
{"name": "2021 Вересень", "url": "http://ilnlicey.ucoz.ua/news/2021-09"},
{"name": "2021 Жовтень", "url": "http://ilnlicey.ucoz.ua/news/2021-10"},
{"name": "2021 Листопад", "url": "http://ilnlicey.ucoz.ua/news/2021-11"},
{"name": "2021 Грудень", "url": "http://ilnlicey.ucoz.ua/news/2021-12"},
{"name": "2022 Січень", "url": "http://ilnlicey.ucoz.ua/news/2022-01"},
{"name": "2022 Лютий", "url": "http://ilnlicey.ucoz.ua/news/2022-02"},
{"name": "2022 Березень", "url": "http://ilnlicey.ucoz.ua/news/2022-03"},
{"name": "2022 Травень", "url": "http://ilnlicey.ucoz.ua/news/2022-05"},
{"name": "2022 Червень", "url": "http://ilnlicey.ucoz.ua/news/2022-06"},
{"name": "2022 Жовтень", "url": "http://ilnlicey.ucoz.ua/news/2022-10"},
{"name": "2022 Листопад", "url": "http://ilnlicey.ucoz.ua/news/2022-11"},
{"name": "2022 Грудень", "url": "http://ilnlicey.ucoz.ua/news/2022-12"},
{"name": "2023 Лютий", "url": "http://ilnlicey.ucoz.ua/news/2023-02"},
{"name": "2023 Квітень", "url": "http://ilnlicey.ucoz.ua/news/2023-04"},
{"name": "2023 Травень", "url": "http://ilnlicey.ucoz.ua/news/2023-05"},
{"name": "2023 Червень", "url": "http://ilnlicey.ucoz.ua/news/2023-06"},
{"name": "2023 Серпень", "url": "http://ilnlicey.ucoz.ua/news/2023-08"},
{"name": "2023 Вересень", "url": "http://ilnlicey.ucoz.ua/news/2023-09"},
{"name": "2023 Жовтень", "url": "http://ilnlicey.ucoz.ua/news/2023-10"},
{"name": "2023 Листопад", "url": "http://ilnlicey.ucoz.ua/news/2023-11"},
{"title": "Урок пам'яті - \" Пам'ять - жива\""},
{"title": "Тренінг з надання першої медичної допомоги"},
{"title": "Європейський тиждень місцевої демократії"},
{"title": "Увага! ЗНО -2015"},
{"title": "Свято \"Золота осінь\""},
{"title": "День учителя"},
{"title": "Учні 5-х та 10-х класів складуть у жовтні міністерські тести!!!"},
{"title": "З наступаючим Новим 2015 роком!"},
{"title": "Настільна книга освітянина \"Трудові та інші права у сфері освіти\""},
{"title": "Структура 2013/2014 навчального року"},
{"title": "Розклад уроків на І семестр 2013-2014 року"},
{"title": "КАЛЕНДАР ВЧИТЕЛЯ НА 2013 – 2014 НАВЧАЛЬНИЙ РІК (п’ятиденний робочий тиждень)"},
{"title": "Учитель року - 2015"},
{"title": "Щира подяка меценатим за дитячу радість"},
{"title": "Свято Миколая"},
{"title": "Розумна чи обдарована дитина: у чому відмінність?"},
{"title": "До уваги абітурієнтів 2015!"},
{"title": "День світової літератури в ліцеї"},
{"title": "Привітання з Днем Святого Миколая"},
{"title": "Як писати твір"},
{"title": "Як запам´ятовувати вірші"},
{"title": "Як вчителю зорієнтуватись у сучасних технологіях?"},
{"title": "Всеукраїнський тиждень права"},
{"title": "Щодо складання тестів ЗНО та умов прийому до ВНЗ у 2015 році"},
{"title": "Портал для учнів та вчителів про безпеку в мережі від Google"},
{"title": "Тематичний тиждень \"Майбутнє без ВІЛ/СНІДу\""},
{"title": "День Збройних Сил України у ліцеї"},
{"title": "Як ми грали в \"Гринвіч\""},
{"title": "З ДНЕМ ЗБРОЙНИХ СИЛ УКРАЇНИ!"},
{"title": "Тиждень хімії в Ільницькому спортивно - гуманітарному ліцеї"},
{"title": "Вшанування жертв голодомору"},
{"title": "Психологічний тренінг \"Толерантність і конфлікти\""},
{"title": "Психологічна підготовка учнів до моніторингу якості освіти"},
{"title": "Уже в лютому на телеканалі М-студіо стартує шоу за участю найсильніших школярів Закарпаття"},
{"title": "Завдання для моніторингу в 10 класі"},
{"title": "Завдання для моніторингу в 5 класі"},
{"title": "У здоровому тілі - здоровий дух!"},
{"title": "22 січня - День Соборності України"},
{"title": "Загинув за Україну. Вічна пам’ять герою!"},
{"title": "Різдвяні привітання"},
{"title": "Де і як зареєструватися для складання ЗНО"},
{"title": "РОЗКЛАД ЗАНЯТЬ ТА ПЛАН ВИХОВНИХ ЗАХОДІВ ІЛЬНИЦЬКОГО СПОРТИВНО-ГУМАНІТАРНОГО ЛІЦЕЮ НА ІІ СЕМЕСТР 2014-2015 н.р."},
{"title": "Наші привітання директору Ільницького спортивно-гуманітарного ліцею - Мереничу Юліану Еміліановичу"},
{"title": "Засідання МО класних керівників в Ільницькому спортивно - гуманітарному ліцеї"},
{"title": "Привітання директору Ільницького спортивно - гуманітарного ліцею Мереничу Ю.Е."},
{"title": "Тести ЗНО онлайн"},
{"title": "15 сайтів, на яких можна завантажити безкоштовні електронні книги"},
{"title": "Дворівневі тести зовнішнього незалежного оцінювання 2015 року"},
{"title": "Календар вчителя на 2014-2015 навчальний рік"},
{"title": "ТАБІР ВІДПОЧИНУ 2015 - \"ВОДОГРАЙ\""},
{"title": "Розклад уроків на І семестр"},
{"title": "Екскурсія у мисливський замок Шенборнів."},
{"title": "Акція \" Милосердя\" від Червоного Хреста під назвою \" Золота осінь\""},
{"title": "Новий навчальний рік - нові перспективи..."},
{"title": "Календаря знаменних і пам'ятних дат на 2014/2015 навчальний рік"},
{"title": "Семінар-тренування з українського лицарського єдиноборства \"Бойовий гопак\" у ліцеї"},
{"title": "\"Безпечне життя\"!"},
{"title": "Юні туристи змагалися в залах"},
{"title": "Міжнародний день рідної мови в Ільницькому ліцеї"},
{"title": "Незбагненна влада музики над людиною"},
{"title": "Ми пам'ятатимем Вас, герої Небесної Сотні !"},
{"title": "Сперечайся, помиляйся, твори"},
{"title": "Профілактика та подолання стресових станів"},
{"title": "Льодовиковий період - 2015"},
{"title": "Новітні технології на уроках природничо-математичного циклу"},
{"title": "Профорієнтаційна бесіда для випускників ліцею"},
{"title": "Відчуття щастя і романтики"},
{"title": "Всеукраїнська акція «Голуб Миру»"},
{"title": "\"Любов, яка вселяє віру\""},
{"title": "Математика - загадкова та неповторна наука"},
{"title": "Будні ліцею"},
{"title": "Про організацію навчально-виховного процесу у загальноосвітніх навчальних закладів і вивчення базових дисциплін в основній школі"},
{"title": "З Днем Конституції України!"},
{"title": "Дослідницька експедиція учнів ліцею"},
{"title": "Літо прийшло !"},
{"title": "Ірина Костюк - гордість ліцею 2015 року"},
{"title": "Наші випускники 2015 року"},
{"title": "Випускний - 2015"},
{"title": "Районні змагання \"Олімпійське лелеченя 2016\""},
{"title": "\"ХОЧУ - МОЖУ - ТРЕБА\""},
{"title": "Запрошення на свято"},
{"title": "Національний український одяг – як символ єдності українського народу"},
{"title": "Запрошуємо до акції \"Одягни вишиванку\""},
{"title": "Стежками мальовничого села Ільниці"},
{"title": "Єдиний урок пам'яті"},
{"title": "Тепла зустріч з ветеранами"},
{"title": "Ніколи знову"},
{"title": "Військово-польові збори учнів 11 класу"},
{"title": "ГОДИНА ЗЕМЛІ 2016"},
{"title": "Гостинний візит театру \"Шарж\""},
{"title": "Відкритий урок учителя української мови Васильєвої Вікторії Петрівни"},
{"title": "Її величність Жінка!"},
{"title": "Засідання атестаційної комісії Ільницького спортивно-гуманітарного ліцею"},
{"title": "Година спілкування \"Людські чесноти: Байдужість, Милосердя, Доброта, Любов\""},
{"title": "Змагання з кросу на призи \"Нового життя\" - 2015"},
{"title": "Участь ліцеїстів в обласній краєзнавчій олімпіаді \"Закарпатський краєзнавець\""},
{"title": "Біль Чорнобиля з роками не зникає..."},
{"title": "Мрії всіх і кожного"},
{"title": "Перемога юних туристів ліцею на Чемпіонаті Закарпатської області з пішохідного туризму"},
{"title": "Конкурс \"Ви перемогли - ми пам'ятаємо\""},
{"title": "ПРИВІТАННЯ ЗІ СВЯТОМ ВЕЛИКОДНЯ!"},
{"title": "Тарас Шевченко - син українського народу!"},
{"title": "Повінь і паводок - біль у серцях і душах багатьох закарпатців."},
{"title": "Засідання школи молодого вчителя математики в ліцеї"},
{"title": "Перемогу здобуто !!!"},
{"title": "\"В цьому імені - слава України:М.Вербицькому - 200 років\""},
{"title": "Привітання з Днем народження!"},
{"title": "Незабутня зустріч з воїном АТО"},
{"title": "Наші призери"},
{"title": "Відкритий урок з математики у 5 класі"},
{"title": "Апробація тестових завдань ЗНО - 2015"},
{"title": "Зі святом 8 Березня!"},
{"title": "Українознавча гра \"Соняшник - 2015\""},
{"title": "Ерудити, які впевнено доводять, що знають все!"},
{"title": "Зустріч з учасниками бойових дій у зоні АТО"},
{"title": "Профорієнтація старшокласників ліцею"},
{"title": "Майстер-клас з історії та правознавства"},
{"title": "Міжнародний день рідної мови в ліцеї"},
{"title": "Пам’ятаємо, сумуємо,співчуваємо..."},
{"title": "Ужгородський національний університет запрошує!"},
{"title": "Продовження карантину!"},
{"title": "«Дороги України»"},
{"title": "День пам'яті захисників України."},
{"title": "\"Кольоровий\"тиждень толерантності."},
{"title": "Змагання з футболу серед школярів громади."},
{"title": "Хліб - наша святиня"},
{"title": "\"Тварини -  наші друзі\""},
{"title": "День туризму 2023"},
{"title": "До уваги батьків!"},
{"title": "\"Жнива скорботи\""},
{"title": "«Вільні творять майбуття»"},
{"title": "«Дитинству – безпечні дороги!»"},
{"title": "Добро починається з ТЕБЕ!"},
{"title": "Благодійний ярмарок для ЗСУ."},
{"title": "Вітання з Днем працівників освіти!"},
{"title": "«У математиці є своя краса, як у поезії та музиці»."},
{"title": "Дзвони Чорнобиля."},
{"title": "Табір,до побачення!"},
{"title": "Виставка \"ВІЙНА В МЕТАЛІ\"."},
{"title": "День без автомобіля - 2023"},
{"title": "День МИРУ - 2023"},
{"title": "Обласний марафон - 2023"},
{"title": "День фізичної культури та спорту України."},
{"title": "День знань 2023"},
{"title": "Увага на дорозі – життя у безпеці !"},
{"title": "Я люблю вишиванку!"},
{"title": "\"ВКЛОНЮСЬ ТОБІ, МАМО!\""},
{"title": "Участь ліцеїстів у спортивній Спартакіаді - 2023."},
{"title": "Всеукраїнська військово-патріотична гра \"Сокіл\" (\"Джура\")."},
{"title": "В гармонії з природою."},
{"title": "Кіберполіція запрошує на онлайн платформу «МРІЯ»"},
{"title": "Христос Воскрес!Воскресне Україна!"},
{"title": "Образ Ісуса в картинах митців."},
{"title": "Поезія - це завжди неповторність"},
{"title": "Останній дзвоник 2023"},
{"title": "«Ми діти сильної країни – України!»"},
{"title": "Нас Єднає Мова!"},
{"title": "Україна пам'ятає – світ визнає!"},
{"title": "Зима,що нас змінила!"},
{"title": "ДЕНЬ ЄДНАННЯ!"},
{"title": "\"Гендерна битва\""},
{"title": "День безпечного інтернету!"},
{"title": "Подяка від воїнів ЗСУ."},
{"title": "\"Україна – країна незламних людей\""},
{"title": "Твій друг – безпечний рух!"},
{"title": "День туризму 2022"},
{"title": "День української писемності та мови в 2022 році."},
{"title": "XIIІ Міжнародний мовно-літературний конкурс імені Тараса Шевченка в ліцеї"},
{"title": "Благодійний ярмарок під гаслом «Допомога ЗСУ»."},
{"title": "Новорічний КВК"},
{"title": "Open Fun Football Schools"},
{"title": "Останній дзвінок 2022"},
{"title": "Ой,хто, хто Миколая любить."},
{"title": "Вічна слава героям-ліквідаторам!"},
{"title": "Всеукраїнська кампанія \"16 днів проти насильства\""},
{"title": "Андріївські вечорниці."},
{"title": "Зустріч з воїном ЗСУ."},
{"title": "Квіти Перемоги."},
{"title": "ДЕНЬ УКРАЇНСЬКОЇ ХУСТКИ – ЧАС РОДИННИХ ТРАДИЦІЙ"},
{"title": "Міжнародний день волонтера: дякуємо усім, хто допомагає!"},
{"title": "Світ не без добрих людей...."},
{"title": "ДЯКУЄМО ВАМ, НАШІ ЗАХИСНИКИ!"},
{"title": "Увага!Важлива інформація!"},
{"title": "З ДНЕМ ЗАХИСТУ ДІТЕЙ!"},
{"title": "До відома учнів та батьків!"},
{"title": "З ДНЕМ ВИШИВАНКИ, УКРАЇНО!"},
{"title": "Збираємось скоренько, Новий рік близенько!"},
{"title": "УВАГА!ДО ВІДОМА УЧНІВ ТА БАТЬКІВ!"},
{"title": "Тиждень правознавства в ліцеї"},
{"title": "День Святого Миколая!"},
{"title": "«Чорнобильська катастрофа: ВЧОРА,СЬОГОДНІ,ЗАВТРА»"},
{"title": "Всеукраїнська акція “16 днів проти насильства”"},
{"title": "Тиждень англійської мови в Ільницькому ліцеї"},
{"title": "«Небесна Сотня. Жива пам’ять»"},
{"title": "З ДНЕМ ЄДНАННЯ, УКРАЇНО!"},
{"title": "Відновлення освітнього процесу в очній формі"},
{"title": "Всесвітній день безпечного Інтернету"},
{"title": "УВАГА! ДИСТАНЦІЙНЕ НАВЧАННЯ ПРОДОВЖЕНО!"},
{"title": "До відома учнів та батьків!"},
{"title": "Відбір підручників для 9 класу у 2021-2022 н.р."},
{"title": "УВАГА! ДО ВІДОМА УЧНІВ ТА ЇХ БАТЬКІВ."},
{"title": "Розклад занять Ільницького спортивно-гуманітарного ліцею на ІІ семестр 2021-2022 навчального року"},
{"title": "\"Живий ланцюг Соборності\"."},
{"title": "Творімо добро разом!"},
{"title": "Виставка осінніх композицій \"Барви осені\""},
{"title": "«Кривава рана на тлі України»"},
{"title": "Випускний бал 2021!"},
{"title": "\" В єдності наша сила!\""},
{"title": "Як змагалися туристи - ліцеїсти."},
{"title": "Зустріч із правоохоронними органами"},
{"title": "Здоров’я — розкіш для людини, найбільша цінність у житті!"},
{"title": "Розклад уроків на І семестр 2021-2022 навчального року"},
{"title": "З Днем знань!"},
{"title": "Літній відпочинок – запорука успішного навчання в наступному році!"},
{"title": "Продзвенів дзвінок останній, соловейком відлетів...."},
{"title": "«Чарівна краса вишиванки»"},
{"title": "Ніхто не забутий, ніщо не забуте!"},
{"title": "«Котися, писанко, по рідному краю»."},
{"title": "«Чисто не там, де прибирають, а там, де не смітять».!"},
{"title": "“Чорнобиль не має минулого”"},
{"title": "“Доля планети в наших руках!”"},
{"title": "Учнів 11-х класів звільнили від ДПА: Рада ухвалила закон"},
{"title": "Учнів 4-х та 9-х класів звільнено від проходження ДПА у 2020/2021 навчальному році"},
{"title": "“За чисте довкілля”"},
{"title": "Любі жінки, вітаємо Вас із святом весни!"},
{"title": "До 150-річчя від дня народження Лесі Українки."},
{"title": "До 150-річчя від дня народження Лесі Українки( Частина ІІІ)."},
{"title": "До 150-річчя від дня народження Лесі Українки.(Частина ІІ)"},
{"title": "До 150-річчя від дня народження Лесі Українки."},
{"title": "«Зима, що нас змінила»"},
{"title": "Увага!"},
{"title": "Увага!Важлива інформація!"},
{"title": "«Світло Вифлеємської Зорі»"},
{"title": "«Забілів снігами гай – іде Святий Миколай.»"},
{"title": "\"МІЙ УЛЮБЛЕНИЙ СВІТ - БЕЗ НАСИЛЛЯ\""},
{"title": "«Ти в цьому світі не один»"},
{"title": "Вивчаємо американські традиції"},
{"title": "\"Знати, щоб жити!\""},
{"title": "«Вогонь скорботи в серці навіки»"},
{"title": "Ільницький спортивно-гуманітарний ліцей здобув перемогу!"},
{"title": "До відома випускників та їх батьків"},
{"title": "Лекції про науку для підлітків від Science Teens Platform"},
{"title": "\"Краща мова єднання – це українська\"."},
{"title": "Умови прийому на навчання для здобуття вищої освіти у 2021 році"},
{"title": "Пробне ЗНО -2021: дати реєстрації та тестування"},
{"title": "Виставка композицій \"Осінні фантазії\""},
{"title": "З ДНЕМ ЗАХИСНИКА УКРАЇНИ!"},
{"title": "Особливості ЗНО -2021"},
{"title": "\"Спасибі Вам, що Ви на світі є ...\""},
{"title": "З ДНЕМ УЧИТЕЛЯ!"},
{"title": "FLEX 2021 - 2022"},
{"title": "Екологічна акція \"Чисті береги\""},
{"title": "Важкоатлети ліцею показали хороші результати"},
{"title": "Які зміни чекають на ЗНО-2021?"},
{"title": "1 вересня – День знань!"},
{"title": "Про продовження карантину та дистанційне навчання в Ільницькому спортивно-гуманітарному ліцеї"},
{"title": "Освітянська конференція - 2020"},
{"title": "Про продовження призупинення освітнього процесу та дистанційне навчання в Ільницькому спортивно-гуманітарному ліцеї"},
{"title": "Про продовження призупинення освітнього процесу та дистанційне навчання в Ільницькому спортивно-гуманітарному ліцеї"},
{"title": "Всеукраїнська школа онлайн: РОЗКЛАД 5-11 КЛАСИ"},
{"title": "Всі порогові бали ЗНО - 2020"},
{"title": "Рекомендації закладам освіти для роботи з 1 вересня"},
{"title": "Про продовження призупинення освітнього процесу та дистанційне навчання в Ільницькому спортивно-гуманітарному ліцеї"},
{"title": "Пам'ятаємо своїх героїв"},
{"title": "Важливе від МОН №2: ЗНО-2020, заповнення журналу на карантині, гроші на розвиток шкіл та корисні матеріали для вчителів"},
{"title": "Методичні рекомендації щодо впровадження дистанційного навчання у закладах загальної середньої освіти Іршавського району"},
{"title": "Із ювілеєм!"},
{"title": "МІЖНАРОДНИЙ ДЕНЬ РІДНОЇ МОВИ В ЛІЦЕЇ"},
{"title": "Про тимчасове призупинення освітнього процесу та дистанційне навчання в Ільницькому спортивно-гуманітарному ліцеї"},
{"title": "\"Серця двох\""},
{"title": "А СОТНЮ ВЖЕ ЗУСТРІЛИ НЕБЕСА,,"},
{"title": "Тимчасове призупинення навчально-виховного процесу та графік відпрацювання"},
{"title": "Увага!Освітній процес тимчасово призупинено!"},
{"title": "\"Подаруй дитині свято\""},
{"title": "Конкурс \"ПАТРІОТ\" - 2019."},
{"title": "\"Запалюємо пам'яті свічу\""},
{"title": "Колядки та щедрівки від \"Ільничанки\""},
{"title": "\"Наркотикам - НІ!\""},
{"title": "Чинні умови вступу до вишів у 2020 році"},
{"title": "Пробне ЗНО - 2020: дати реєстрації та тестування"},
{"title": "Чому людство святкує Різдво?"},
{"title": "«STOP булінг»"},
{"title": "\"Нумо, хлопці!\""},
{"title": "День захисника України"},
{"title": "До поліції - на екскурсію!"},
{"title": "День туризму: яскраво, весело, пізнавально!"},
{"title": "З ДНЕМ ВЧИТЕЛЯ!"},
{"title": "ДЕНЬ САМОВРЯДУВАННЯ У ЛІЦЕЇ: одинадцятикласники у ролі вчителів!"},
{"title": "\"Тютюн зїдає тебе живим.Кинь курити сьогодні!\""},
{"title": "Виставка осінніх композицій «Барви осені»"},
{"title": "\"Я навчаюся жити від тебе\""},
{"title": "Вітаємо переможців творчих та мовознавчих конкурсів!"},
{"title": "Вітаємо переможців ІІ етапу олімпіад!"},
{"title": "\"Розтопи своє серце - допоможемо дітям разом\"."},
{"title": "Календар учителя на 2019-2020 навчальний рік"},
{"title": "II (обласний) етап Всеукраїнської дитячо-юнацької військово-патріотичної гри „Сокіл” („Джура”)"},
{"title": "Звіт про підсумки методичної роботи в Ільницькому спортивно-гуманітарному ліцеї"},
{"title": "РОЗКЛАД ЗАНЯТЬ НА І СЕМЕСТР 2019-2020 НАВЧАЛЬНОГО РОКУ"},
{"title": "Перший дзвоник пролунав...."},
{"title": "Підготовка учасників до обласного етапу гри \"Джура\""},
{"title": "Робота рою ім.О.Данильченка протягом 2018 - 2019 н.р."},
{"title": "Гра сміливих і відважних- “Сокіл” (“Джура”)."},
{"title": "Вступна кампанія - 2019 в датах"},
{"title": "Графік ЗНО - 2019"},
{"title": "Прийом у перший клас"},
{"title": "\"ОДНА ЄДИНА СОБОРНА УКРАЇНА\""},
{"title": "Семінар - тренінг в Ільницькому спортивно-гуманітарному ліцеї"},
{"title": "«Їх подвиг — приклад для нас»"},
{"title": "День безпеки в Інтернеті!"},
{"title": "Призери ІІ етапу Всеукраїнської олімпіади з базових дисциплін 2018-2019 навчального року"},
{"title": "Вшанували героя АТО в ліцеї."},
{"title": "Cтартувала реєстрація на пробне ЗНО"},
{"title": "Всеукраїнська акція \"16 днів проти насильства\""},
{"title": "Олімпіада з декоративно-ужиткового мистецтва."},
{"title": "Про проведення державної підсумкової атестації у 2018/2019 навчальному році"},
{"title": "Осіння ярмарка \"Дари осені\" 2018!"},
{"title": "Свято української пісні \"Пісня лине соловїна\""},
{"title": "\" Ми чуємо тебе ,Кобзарю,  крізь століття\""},
{"title": "205-тій річниці від Дня народження Тараса Шевченка присвячується..."},
{"title": "До уваги всіх, хто складатиме ЗНО -2019 з української мови та літератури!"},
{"title": "День туризму в ліцеї 2018!"},
{"title": "Виступ ліцеїстів на районному святі \"Новорічна ялинка\""},
{"title": "\"Щоб успішно розвиватись, потрібно спортом нам займатись!!!\""},
{"title": "День відкритих дверей в Іршавській РДА"},
{"title": "“Колишніх” вчителів не буває: привітання педагогів-ветеранів!"},
{"title": "\"Все починається з добра,все починається з любові…\""},
{"title": "“Зігріймо серце добротою”"},
{"title": "ЗНО-2019"},
{"title": "РОЗКЛАД ЗАНЯТЬ НА І СЕМЕСТР 2018-2019 НАВЧАЛЬНОГО РОКУ"},
{"title": "Інтелектуальна гра \"Найрозумніший\""},
{"title": "Свято доблесті і мужності!"},
{"title": "Світ без насилля очима дітей."},
{"title": "\"Чужого горя не буває\""},
{"title": "Годину трагічну вшануємо разом"},
{"title": "Свято Першого дзвоника - 2018"},
{"title": "УЧАСТЬ ЛІЦЕЇСТІВ У ПРОЕКТІ “ZERO WASTE SCHOOL\""},
{"title": "«Пам’ять про подвиг»"},
{"title": "Акція \"Голуб миру\""},
{"title": "Робочий навчальний план Ільницького спортивно-гуманітарного ліцею Іршавської районної ради Закарпатської області на 2018/2019 н. р."},
{"title": "Звіт з методичної роботи Ільницького спортивно-гуманітарного ліцею за 2017-2018 навчальний рік"},
{"title": "ДЕНЬ ВИШИВАНКИ -2018"},
{"title": "Тиждень хімії в ліцеї."},
{"title": "Закриття табору \"Веселка\" - 2018"},
{"title": "Табір\"Веселка\" 2018."},
{"title": "Останній дзвінок 2018"},
{"title": "День матері в ліцеї."},
{"title": "Замовлення підручників для 5 та 10 класу"},
{"title": "\"Не загасити пам'яті вогонь\""},
{"title": "День цивільного захисту 2018"},
{"title": "Вітаємо нашу футбольну команду!!!"},
{"title": "Участь ліцеїстів в інтелектуальній грі \"Найрозумніший\"."},
{"title": "Тиждень математики в ліцеї."},
{"title": "Для Вас жінки!"},
{"title": "Акція «Збережемо Первоцвіти» в ліцеї."},
{"title": "\"Тепло моєї родини\""},
{"title": "З Святом Весни - 8 Березня!"},
{"title": "Отрута у привабливій упаковці"},
{"title": "КРАЩА МОВА ЄДНАННЯ – УКРАЇНСЬКА!"},
{"title": "Краса рідної мови"},
{"title": "«А сотню вже зустріли небеса»"},
{"title": "Колядує увесь світ, колядують учні ліцею!"},
{"title": "Із ювілеєм Юліан Еміліанович!"},
{"title": "З НОВИМ РОКОМ!"},
{"title": "По Вкраїні з краю в край ходить святий Миколай"},
{"title": "Вшанування жертв голодоморів"},
{"title": "Про відзначення Дня Гідності і Свободи"},
{"title": "14 грудня - День вшанування ліквідаторів наслідків аварії на ЧАЕС."},
{"title": "Наші будні"},
{"title": "Профорієнтаційна робота ліцею"},
{"title": "Зустріч учнів ліцею з працівником поліції"},
{"title": "Святкове відкриття футбольного поля."},
{"title": "Участь ліцеїстів в конкурсі екологічної просвіти."},
{"title": "Міжнародний день непаління в ліцеї"},
{"title": "Тиждень безпеки дорожнього руху"},
{"title": "Місячник шкільних бібліотек"},
{"title": "Осіння ярмарка 2017."},
{"title": "Інформація про використання публічних коштів"},
{"title": "Пробне ЗНО - 2018"},
{"title": "“Розтопи своє серце – допоможемо дітям разом”"},
{"title": "В ліцеї відзначили День Захисника України!"},
{"title": "Зустріч ліцеїстів з пожежниками."},
{"title": "Карантин в навчальних закладах Іршавського району"},
{"title": "Літній мовний табір \"Friends\""},
{"title": "\"Соборність України: від ідеї до сьогодення\""},
{"title": "РОЗКЛАД ЗАНЯТЬ НА ІІ СЕМЕСТР 2017-2018 НАВЧАЛЬНОГО РОКУ"},
{"title": "Відкриття меморіальної дошки герою АТО."},
{"title": "Перенесення робочих днів у 2018 році"},
{"title": "З ДНЕМ НЕЗАЛЕЖНОСТІ!"},
{"title": "Проведено навчання з евакуації учнів та працівників."},
{"title": "Працівник НПП «Зачарований край» разом з дітьми прощалися з літньою табірною зміною"},
{"title": "Основне про ЗНО та ДПА у формі ЗНО-2018"},
{"title": "Участь ліцеїстів в конкурсі \"Патріот\""},
{"title": "З Днем захисника України!"},
{"title": "День туризму - 2017!"},
{"title": "ВІТАЄМО З ДНЕМ УЧИТЕЛЯ!"},
{"title": "Рейтинг шкіл Закарпаття-2017"},
{"title": "ЗНО-2018"},
{"title": "Про правила користування мобільними телефонами під час навчально-виховного процесу"},
{"title": "РОЗКЛАД ЗАНЯТЬ НА І СЕМЕСТР 2017-2018 НАВЧАЛЬНОГО РОКУ"},
{"title": "Посвята в ліцеїсти!"},
{"title": "Танцювальна студія \"Stars of Dance\""},
{"title": "Структура 2017/2018 навчального року"},
{"title": "ДЕНЬ ВИШИВАНКИ -2017"},
{"title": "Зустріч з ветеранами війни"},
{"title": "Такі цікаві ці природничі науки......."},
{"title": "1939 - 1945 НІКОЛИ ЗНОВУ!"},
{"title": "Всеукраїнська акція «Зробимо Україну чистою разом» - 2017."},
{"title": "О,писанко. Ти -символ України!"},
{"title": "НАЦІОНАЛЬНО -ПАТРІОТИЧНЕ ВИХОВАННЯ У СІЧНІ 2017 року."},
{"title": "З ВЕЛИКОДНЕМ!"},
{"title": "Успішний виступ Ільницьких ліцеїстів"},
{"title": "Участь ліцеїстів в акції «Майбутнє лісу у твоїх руках 2017!»"},
{"title": "Від Революції гідності - до пам'яті про Небесну сотню!"},
{"title": "\"Від екології природи - до екології душі\""},
{"title": "Тиждень англійської мови в ліцеї"},
{"title": "Участь ліцеїстів у конкурсі «Земля – наш спільний дім»."},
{"title": "Успіхи наших важкоатлетів"},
{"title": "РОЗКЛАД ЗАНЯТЬ НА ІІ СЕМЕСТР 2016-2017 НАВЧАЛЬНОГО РОКУ"},
{"title": "Увага! Триває реєстрація на пробне ЗНО-2017 !!!"},
{"title": "ВСЕУКРАЇНСЬКА КАМПАНІЯ \"ГОДИНА ЗЕМЛІ - 2017\""},
{"title": "Зі святом вас, любі жінки!"},
{"title": "Наші важкоатлети - серед кращих!"},
{"title": "\"Нумо, хлопці!\""},
{"title": "Радіємо за наших манівців!!!"},
{"title": "РОЗКЛАД ЗАНЯТЬ НА ІІ СЕМЕСТР 2016-2017 НАВЧАЛЬНОГО РОКУ"},
{"title": "Вшанування подвигу учасників Революції гідності"},
{"title": "Зустріч учнів ліцею з працівниками поліції"},
{"title": "ЗНО-2017"},
{"title": "Осіння ярмарка - 2016"},
{"title": "Вітання з Днем захисника України!"},
{"title": "Подарунки від Святого Миколая"},
{"title": "Ой хто, хто Миколая любить..."},
{"title": "ГЕЛІАНТУС - 2016"},
{"title": "Всеукраїнський Тиждень права в ліцеї"},
{"title": "Флешмоб до Дня фізкультурника."},
{"title": "Толерантність врятує світ."},
{"title": "Дорогі вчителі ліцею!"},
{"title": "Про проведення 1 вересня 2016 року Першого уроку"},
{"title": "Моніторинг з біології, алгебри та геометрії (9 клас)"},
{"title": "ВІТАЄМО З ДНЕМ НЕЗАЛЕЖНОСТІ УКРАЇНИ!"},
{"title": "\"Безпека на дорозі - показник культури нації\""},
{"title": "Вдалий дебют юного ліцеїста"},
{"title": "РОЗКЛАД ЗАНЯТЬ НА І СЕМЕСТР 2016-2017 НАВЧАЛЬНОГО РОКУ"},
{"title": "ПРИВІТАННЯ З ПОЧАТКОМ НАВЧАЛЬНОГО РОКУ!"},
{"title": "Літній мовний табір \"Happy Campers\""},
{"title": "Екскурсія стежками Закарпаття(Колочава - Синевир)"},
{"title": "Моніторинг з англійської мови, біології, хімії, алгебри, геометрії (11 клас)"},
{"title": "Шкідливі звички.Жити - чи курити?!"},
{"title": "Моніторинг з географії (10 клас)"},
{"title": "Моніторинг з історії України (11 клас)"},
{"title": "9 листопада - День української писемності та мови"},
{"title": "Екскурсія на фірму ТОВ \"К'Лен\" в Ільниці."},
{"title": "З ДНЕМ ДЕРЖАВНОГО ПРАПОРА!"},
{"title": "ОГОЛОШЕННЯ ПРО ПРИЙОМ НА НАВЧАННЯ!"},
{"title": "Моніторинг з української мови та літератури 9,11 клас"},
{"title": "Показові виступи з важкої атлетики."},
{"title": "ТАБІР \"ВЕСЕЛКА\" 2016 (ВІДКРИТТЯ)"},
{"title": "Звіт про науково-методичну роботу Ільницького спортивно-гуманітарного ліцею за 2015-2016 н.р."},
{"title": "Г рафік серпневих нарад та засідань районних методичних об’єднань, 2016 рік"},
{"title": "ФОТОАЛЬМАНАХ проведення Тижня безпеки дорожнього руху"},
{"title": "ВІТАННЯ З ВЕЛИКОДНІМИ СВЯТАМИ!"},
{"title": "19 травня - ДЕНЬ ВИШИВАНКИ. ПОКАЖИ,що ТИ УКРАЇНЕЦЬ!!!!"},
{"title": "Пам'ятай про Крути!"},
{"title": "До 450-ої річниці від дня народження Вільяма Шекспіра"},
{"title": "Участь ліцеїстів в акції \"Зробимо Україну чистою разом!\""},
{"title": "Старшокласники розкривають таємницю Великого Долу та доводять істинність християнства"},
{"title": "«Людське життя – велика цінність»!"},
{"title": "Математичний турнір у ліцеї"},
{"title": "Тиждень математики в ліцеї"},
{"title": "Шевченківський тиждень"},
{"title": "\"НІКОЛИ ЗНОВУ\""},
{"title": "8 травня - День пам’яті та примирення.9 - День Перемоги над нацизмом в Європі"},
{"title": "КАРАНТИН"},
{"title": "22 січня - День Соборності України"},
{"title": "Предметні олімпіади 2015-2016 навчального року"},
{"title": "Результативність науково-дослідницької роботи учнів ліцею"},
{"title": "Розклад уроків на ІІ семестр 2015-2016 навчального року"},
{"title": "Міжнародний учнівський конкурс юних істориків \"ЛЕЛЕКА\" - 2016"},
{"title": "Відкриття туристичного сезону - 2016"},
{"title": "СПОГАДИ - БЕЗЦІННА СКАРБНИЦЯ ДЛЯ ДІТЕЙ!"},
{"title": "Успіхи наших вихованців - юних туристів"},
{"title": "Година спілкування з учнями спортивних класів"},
{"title": "Привітання з Днем народження!"},
{"title": "З Першим вересня!"},
{"title": "\"ОЙ ТАМ, НА ТОВЧКУ, НА БАЗАРІ,,,\""},
{"title": "Україна в скорботі вшановує пам'ять жертв голодоморів"},
{"title": "Тиждень іноземних мов у ліцеї"},
{"title": "У ліцеї відзначили 150-річчя від дня народження митрополита Андрея Шептицького"},
{"title": "Батьківські збори в ліцеї"},
{"title": "День української писемності та мови в ліцеї"},
{"title": "Незабутня подорож до міста Лева"},
{"title": "Пишаємось нашими вихованцями !"},
{"title": "Початок навчального року: що необхідно знати"},
{"title": "\"А я просто українка, україночка!\""},
{"title": "З Днем державного прапора України !"},
{"title": "Із Днем незалежності України!"},
{"title": "Випускний 2015"},
{"title": "Захоплююча мандрівка учнів ліцею"},
{"title": "З ДНЕМ ЗАХИСНИКА УКРАЇНИ!"},
{"title": "Знаємо права, виконуємо обов'язки"},
{"title": "У ліцеї відзначали День туризму"},
{"title": "Зв'язок теорії з практикою"},
{"title": "День іменинника в ліцеї"},
{"title": "До уваги вчителів!"},
{"title": "Відбір на навчання за програмою UWC на 2016-2018 навчальні роки"},
{"title": "Про тематику Першого уроку в 2015/2016 навчальному році"},
{"title": "Відбулися засідання методоб'єднань у ліцеї"},
{"title": "День самоврядування в ліцеї"},
{"title": "Даруємо посмішку та хороший настрій !!!"},
{"title": "Вітаємо з святом, колеги !!!"},
{"title": "Конкурс з англійської мови \"Гринвіч\""},
{"title": "ПРИВІТАННЯ З НОВИМ РОКОМ!"},
{"title": "Акція - флешмоб \"Голуб миру\""},
{"title": "Розклад уроків на І семестр 2015-2016 навчальний рік"},
{"title": "\"Ми хороші пішоходи - ви найкращі водії!\""},
{"title": "Навчальний календар на 2015/2016 н.р."},
{"title": "Музичний подарунок Ільницької дитячої школи мистецтв"},
{"title": "\"Йде Святий Миколай, ти добром його стрічай!\""},
{"title": "Тиждень природничих дисциплін у ліцеї"},
{"title": "\" Учитель року - 2016\""},
{"title": "Вітаємо нашого вчителя - переможця І етапу Всеукраїнського конкурсу \"Учитель року-2016\""},
{"title": "Відкритий урок учителя зарубіжної літератури Райди Марії Василівни"},
{"title": "Відкритий урок учителя англійської мови Попович Тетяни Михайлівни"},
{"title": "З Днем Збройних Сил України!"},
{"title": "\"ГЕТЬ ПАЛІННЯ! МИ - ЗДОРОВЕ ПОКОЛІННЯ!\""},
{"title": "Всеукраїнський тиждень права в ліцеї"}
]