id_niveau;code_matiere
1LAD;201
1LAD;201
1LAD;188
1LAD;188
1LAD;56
1LAD;56
1LAD;169
1LAD;169
1LAD;120
1LAD;214
1LAD;214
1LAD;265
1LAD;215
1LAD;215
1LAD;216
1LAD;216
1LAD;70
1LAD;38
1LAD;71
1LAD;71
1LAD;71
1LAD;71
1LAD;72
1LAD;72
