category_id;name;description
1;bouteille;bouteille
2;bouteille;bouteille
3;bouteille;bouteille
1;chaise;chaise
2;chaise;chaise
3;chaise;chaise
1;assiette;assiette
2;assiette;assiette
3;assiette;assiette
