id_niveau;code_matiere
1LAD;209
1LAD;209
1LAD;210
1LAD;210
1LAD;211
1LAD;211
1LAD;212
1LAD;212
1LAD;213
1LAD;214
1LAD;214
1LAD;215
1LAD;215
1LAD;215
1LAD;216
1LAD;216
1LAD;70
1LAD;70
1LAD;71
1LAD;71
1LAD;71
1LAD;71
1LAD;72
1LAD;72
