id_niveau;code_matiere;nombreetudiant;dateexamen;heureexamen
1LFD;150;60;04/06/2019;09
1LFD;88;110;04/06/2019;09
1LFD;105;25;08/06/2019;09
1LFD;125;40;05/06/2019;09
1LFD;155;140;07/06/2019;10
1LFD;185;26;04/06/2019;10
1LFD;147;70;05/06/2019;11
1LFD;169;80;08/06/2019;11
1LFD;120;50;07/08/2019;09
1LFD;188;60;04/06/2019;09
1LFD;201;90;05/06/2019;09
1LFD;56;17;07/06/2019;11
2LFDPR;136;160;05/06/2019;13
2LFDPR;160;50;06/06/2019;14
2LFDPR;145;24;04/06/2019;09
2LFDPR;44;50;05/06/2019;09
2LFDPR;127;80;08/06/2019;09
2LFDPR;260;20;07/06/2019;09
2LFDPR;265;99;05/06/2019;09
2LFDPR;31;70;04/06/2019;10
2LFDPR;170;50;05/06/2019;10
2LFDPR;191;20;06/06/2019;10
2LFDPR;95;15;07/08/2019;10


