id_niveau;code_matiere;nombreetudiant;dateexamen;heureexamen
2LFDPR;116;50;06/06/2019;14
2LFDPR;216;24;04/06/2019;09
2LFDPR;35;50;05/06/2019;09
2LFDPR;206;80;08/06/2019;09
2LFDPR;328;20;07/06/2019;09
2LFDPR;213;99;05/06/2019;09
2LFDPR;217;70;04/06/2019;10
1LFD;160;20;04/06/2019;09
1LFD;123;20;07/06/2019;09
1LFD;309;20;04/06/2019;10
1LFD;257;20;05/06/2019;09
1LFD;153;20;07/06/2019;11
1LFD;41;20;08/06/2019;09
1LFD;254;20;06/06/2019;09




