id_niveau;code_matiere;nombreetudiant;dateexamen;heureexamen
1LFD;258;110;04/06/2019;09
1LFD;40;25;08/06/2019;09
1LFD;307;40;05/06/2019;09
1LFD;308;140;07/06/2019;10
1LFD;198;26;04/06/2019;10
1LFD;205;70;05/06/2019;11
1LFD;237;80;08/06/2019;11
1LFD;18;50;07/08/2019;09
1LFD;63;60;04/06/2019;09
2LFDPR;65;60;06/06/2019;09
2LFDPR;323;70;07/06/2019;09
2LFDPR;164;80;08/06/2019;09
2LFDPR;185;20;07/06/2019;09
2LFDPR;228;50;08/06/2019;09
2LFDPR;171;10;06/06/2019;09
2LFDPR;306;20;07/06/2019;09


