id_niveau;code_matiere;nombreetudiant
1LFD;150;60
1LFD;88;110
1LFD;105;25
1LFD;125;40
1LFD;155;140
1LFD;185;26
1LFD;147;70
1LFD;169;80
1LFD;120;50
1LFD;188;60
1LFD;201;90
1LFD;56;17
2LFDPR;136;160
2LFDPR;160;50
2LFDPR;145;24
2LFDPR;44;50
2LFDPR;127;80
2LFDPR;260;20
2LFDPR;265;99
2LFDPR;31;70
2LFDPR;170;50
2LFDPR;191;20
2LFDPR;95;15


