Modlitba veriacich (rôzne predlohy) .............. 1018

Príprava na omšu ....................... 1026
Poďakovanie po omší ..................... 1029
Abecedný zoznam sviatkov svätých .............. 1035
Zoznam piesní vďaky čiže prefácií ............... m4;
Obsah . ............................ 1047

1052 OBSAH

