,Frequency,Voltages,Impedance,Phase
0,5000000.0,1.1035199931600002,2.1599998474,-11.4970054626
1,5002000.0,1.11263997948,2.1599998474,-10.8000001907
2,5004000.0,1.13087994756,2.1599998474,-11.5430860519
3,5006000.0,1.13087994756,2.1599998474,-10.1002006531
4,5008000.0,1.14912000228,2.1799998283,-11.5430860519
5,5010000.0,1.15823998632,2.1799998283,-11.1823644638
6,5012000.0,1.16735997036,2.1799998283,-10.1002006531
7,5014000.0,1.1764799544,2.1799998283,-11.5430860519
8,5016000.0,1.18559993844,2.1799998283,-11.5430860519
9,5018000.0,1.2038399931600001,2.1799998283,-10.8216428757
10,5020000.0,1.2129599772,2.1799998283,-12.2645292282
11,5022000.0,1.2220799635200001,2.1799998283,-10.8433742523
12,5024000.0,1.2403199316,2.1799998283,-11.5895376205
13,5026000.0,1.25855998632,2.1999998093,-11.5895376205
14,5028000.0,1.25855998632,2.1799998283,-11.5895376205
15,5030000.0,1.2767999544000002,2.1999998093,-11.5895376205
16,5032000.0,1.29504000912,2.1999998093,-10.8651914597
17,5034000.0,1.29504000912,2.1799998283,-11.5895376205
18,5036000.0,1.3132799772000001,2.1999998093,-12.3138828278
19,5038000.0,1.33151994756,2.1999998093,-11.5895376205
20,5040000.0,1.34976,2.1999998093,-11.612903595
21,5042000.0,1.34976,2.1999998093,-11.2727270126
22,5044000.0,1.36799997036,2.1999998093,-10.887096405
23,5046000.0,1.38623993844,2.2200000286,-11.6363639832
24,5048000.0,1.40447999316,2.2200000286,-12.3387098312
25,5050000.0,1.42271996124,2.1999998093,-11.6363639832
26,5052000.0,1.4318399452800001,2.2200000286,-11.6363639832
27,5054000.0,1.44095992932,2.2200000286,-11.6363639832
28,5056000.0,1.45919989968,2.2200000286,-12.0
29,5058000.0,1.47744003876,2.2200000286,-11.6599187851
30,5060000.0,1.49568000684,2.2200000286,-12.3886632919
31,5062000.0,1.5139199772,2.2200000286,-11.6599187851
32,5064000.0,1.53215994528,2.2200000286,-10.9311733246
33,5066000.0,1.55039991336,2.2400000095,-11.6599187851
34,5068000.0,1.56863988372,2.2200000286,-10.9533462524
35,5070000.0,1.5868800228,2.2400000095,-11.6835689545
36,5072000.0,1.60511999088,2.2400000095,-11.7073173523
37,5074000.0,1.62335996124,2.2400000095,-11.6835689545
38,5076000.0,1.64159992932,2.2599999905,-10.9533462524
39,5078000.0,1.6598398974000002,2.2400000095,-11.6835689545
40,5080000.0,1.6963200068400002,2.2400000095,-10.2439031601
41,5082000.0,1.71455997492,2.2599999905,-10.975610733
42,5084000.0,1.7327999452799998,2.2400000095,-12.4137926102
43,5086000.0,1.76928005244,2.2599999905,-10.975610733
44,5088000.0,1.76928005244,2.2599999905,-10.9979629517
45,5090000.0,1.8057599908800002,2.2599999905,-11.7311601639
46,5092000.0,1.8422399293200002,2.2599999905,-10.9979629517
47,5094000.0,1.8604798973999999,2.2599999905,-10.9979629517
48,5096000.0,1.87871986548,2.2799999714,-11.0204086304
49,5098000.0,1.91519997492,2.2799999714,-12.4897966385
50,5100000.0,1.9516799110800003,2.2799999714,-11.0204086304
51,5102000.0,1.98816002052,2.2799999714,-10.9979629517
52,5104000.0,2.0063999886,2.2799999714,-11.0204086304
53,5106000.0,2.04287992704,2.2999999523,-11.0429439545
54,5108000.0,2.06111989512,2.2799999714,-11.0204086304
55,5110000.0,2.0975998335600003,2.2999999523,-11.0429439545
56,5112000.0,2.134079943,2.2999999523,-11.7551021576
57,5114000.0,2.1705600501599998,2.2999999523,-12.5153369904
58,5116000.0,2.2070399886,2.2999999523,-12.5153369904
59,5118000.0,2.26175989512,2.3199999332,-11.0882949829
60,5120000.0,2.29824000228,2.3199999332,-11.803278923
61,5122000.0,2.33471994072,2.3199999332,-11.065574646
62,5124000.0,2.38944001824,2.3199999332,-11.803278923
63,5126000.0,2.42591995668,2.3399999142,-12.5409841537
64,5128000.0,2.4623998951200003,2.3399999142,-12.5409841537
65,5130000.0,2.51711997036,2.3399999142,-12.5409841537
66,5132000.0,2.5718400478800003,2.3399999142,-11.8396711349
67,5134000.0,2.6265599544000002,2.3599998951,-11.8275146484
68,5136000.0,2.68127986092,2.3599998951,-12.566734314
69,5138000.0,2.73599993844,2.3599998951,-12.1971244812
70,5140000.0,2.79072001596,2.379999876,-13.3333339691
71,5142000.0,2.84543992248,2.3599998951,-12.5925931931
72,5144000.0,2.91839979936,2.379999876,-12.5925931931
73,5146000.0,2.99136001368,2.379999876,-14.0740747452
74,5148000.0,3.04607992248,2.4000000954,-13.360824585
75,5150000.0,3.1190397970799997,2.4000000954,-13.7037038803
76,5152000.0,3.1920000136800004,2.4000000954,-13.360824585
77,5154000.0,3.2649598905600006,2.4200000763,-13.3333339691
78,5156000.0,3.3744000433200005,2.4200000763,-13.360824585
79,5158000.0,3.4200001367999997,2.4400000572,-11.876288414
80,5160000.0,3.51120032148,2.4400000572,-12.6185560226
81,5162000.0,3.60240016644,2.4400000572,-12.6446275711
82,5164000.0,3.6936000114,2.4600000381,-13.3884296417
83,5166000.0,3.78480019608,2.4600000381,-12.6708068848
84,5168000.0,3.96720022572,2.4800000191,-12.6446275711
85,5170000.0,4.05840007068,2.4800000191,-13.0299901962
86,5172000.0,4.19520034884,2.5,-13.4161481857
87,5174000.0,4.33199994528,2.5,-14.1322307587
88,5176000.0,4.5144003146400005,2.5199999809,-13.4161481857
89,5178000.0,4.605600159600001,2.5399999619,-13.4161481857
90,5180000.0,4.788000189240001,2.5599999428,-14.1614894867
91,5182000.0,4.97040022116,2.5599999428,-14.1908712387
92,5184000.0,5.198400342,2.5999999046,-14.9377593994
93,5186000.0,5.4264001254,2.5999999046,-14.9377593994
94,5188000.0,5.60880049476,2.6199998856,-14.9377593994
95,5190000.0,5.882400369360001,2.6399998665,-14.9377593994
96,5192000.0,6.15600024396,2.6599998474,-14.9688148499
97,5194000.0,6.475200212040001,2.6799998283,-15.6846475601
98,5196000.0,6.794400180119999,2.7199997902,-16.4656963348
99,5198000.0,7.1592002394,2.7400000095,-16.4656963348
100,5200000.0,7.56960039216,2.7599999905,-16.4656963348
101,5202000.0,7.98000054264,2.7999999523,-16.8399162292
102,5204000.0,8.48160088008,2.8399999142,-16.4656963348
103,5206000.0,9.02880063156,2.879999876,-17.25
104,5208000.0,9.75840075012,2.9200000763,-17.2860126495
105,5210000.0,10.396800684,2.9600000381,-18.0
106,5212000.0,11.21760098952,3.0,-19.5407085419
107,5214000.0,12.12960011856,3.0399999619,-19.5407085419
108,5216000.0,13.22400097812,3.0999999046,-21.0438404083
109,5218000.0,14.50080084816,3.1599998474,-21.4196243286
110,5220000.0,15.86880090288,3.1999998093,-21.7954063416
111,5222000.0,17.419201326960003,3.2399997711,-22.5941429138
112,5224000.0,19.15200076152,3.2399997711,-24.0752353668
113,5226000.0,20.97600173964,3.1999998093,-26.3598327637
114,5228000.0,22.8,3.0799999237,-28.6192474365
115,5230000.0,23.894402218440003,2.879999876,-30.8786621094
116,5232000.0,24.62400097812,2.5999999046,-33.8912124634
117,5234000.0,24.259200239400002,2.1999998093,-38.4100418091
118,5236000.0,23.16480073872,1.7599999905,-44.528301239
119,5238000.0,21.70560049932,1.3799999952,-53.584903717
120,5240000.0,19.88160088008,1.0240000486,-64.9056625366
121,5242000.0,18.05760126084,0.8080000281,-82.2641525269
122,5244000.0,16.41600065208,0.7120000124,-101.8867874146
123,5246000.0,14.95680041268,0.7200000286,-124.7899246216
124,5248000.0,13.680000542639998,0.7840000391,-141.1320800781
125,5250000.0,12.585601044239999,0.8799999952,-151.2605133057
126,5252000.0,11.58240036936,0.9680000544,-159.5798339844
127,5254000.0,10.670400560880001,1.0480000973,-164.1176605225
128,5256000.0,9.94080044004,1.128000021,-167.8991699219
129,5258000.0,9.211200321480002,1.1920000315,-170.5263061523
130,5260000.0,8.755200075240001,1.256000042,-173.5578765869
131,5262000.0,8.20800032604,1.3200000525,-175.0736694336
132,5264000.0,7.752000761520001,1.3680000305,-176.0168609619
133,5266000.0,7.3872000228,1.4079999924,-177.7215118408
134,5268000.0,7.02240064068,1.4480000734,-178.4810180664
135,5270000.0,6.65759990196,1.5,179.2405090332
136,5272000.0,6.247200428640001,1.5399999619,178.0972595215
137,5274000.0,5.973600554040001,1.5799999237,178.4810180664
138,5276000.0,5.79120018468,1.5999999046,176.962020874
139,5278000.0,5.517600310080001,1.6199998856,176.962020874
140,5280000.0,5.3352002804400005,1.6599999666,176.962020874
141,5282000.0,5.10720015732,1.6599999666,175.8139648438
142,5284000.0,4.8792003762,1.6999999285,175.8139648438
143,5286000.0,4.69680000456,1.6999999285,175.8139648438
144,5288000.0,4.605600159600001,1.7200000286,174.2917633057
145,5290000.0,4.423200129960001,1.7400000095,174.661026001
146,5292000.0,4.24080044004,1.7599999905,174.2917633057
147,5294000.0,4.14960025536,1.7799999714,174.2917633057
148,5296000.0,4.01280031692,1.7999999523,173.8983154297
149,5298000.0,3.8760003807600003,1.7999999523,173.5031890869
150,5300000.0,3.78480019608,1.8199999332,173.1355895996
151,5302000.0,3.6936000114,1.8199999332,173.5031890869
152,5304000.0,3.60240016644,1.8399999142,173.1355895996
153,5306000.0,3.51120032148,1.8399999142,172.340423584
154,5308000.0,3.4200001367999997,1.8599998951,172.3728790283
155,5310000.0,3.3287999521200002,1.8599998951,172.340423584
156,5312000.0,3.2649598905600006,1.879999876,173.1063842773
157,5314000.0,3.1920000136800004,1.879999876,171.9745178223
158,5316000.0,3.1190397970799997,1.8999999762,173.1063842773
159,5318000.0,3.04607992248,1.8999999762,172.738861084
160,5320000.0,2.9731200456,1.9199999571,172.340423584
161,5322000.0,2.91839979936,1.9199999571,171.5744628906
162,5324000.0,2.84543992248,1.9199999571,171.5744628906
163,5326000.0,2.79072001596,1.9199999571,172.340423584
164,5328000.0,2.73599993844,1.939999938,171.9403076172
165,5330000.0,2.68127986092,1.939999938,171.9403076172
166,5332000.0,2.6265599544000002,1.939999938,171.5384521484
167,5334000.0,2.5718400478800003,1.939999938,173.0769195557
168,5336000.0,2.5353599407200003,1.9600000381,171.5384521484
169,5338000.0,2.49887983128,1.9600000381,171.1349029541
170,5340000.0,2.44415992476,1.9800000191,171.5384521484
171,5342000.0,2.38944001824,1.9800000191,171.9057769775
172,5344000.0,2.35295991108,1.9800000191,171.9057769775
173,5346000.0,2.31647997264,1.9800000191,171.1349029541
174,5348000.0,2.2799998632,2.0,171.1349029541
175,5350000.0,2.24351992704,1.9800000191,170.3640289307
176,5352000.0,2.2070399886,2.0,170.3640289307
177,5354000.0,2.2070399886,2.0,170.729598999
178,5356000.0,2.134079943,2.0,170.729598999
179,5358000.0,2.0975998335600003,2.0199999809,170.729598999
180,5360000.0,2.06111989512,2.0199999809,171.5021362305
181,5362000.0,2.02463995896,2.0199999809,171.5021362305
182,5364000.0,1.98816002052,2.0199999809,170.729598999
183,5366000.0,1.96991988144,2.0199999809,170.3433380127
184,5368000.0,1.9516799110800003,2.0199999809,170.729598999
185,5370000.0,1.91519997492,2.0199999809,171.5021362305
186,5372000.0,1.8969600045600001,2.0399999619,170.3225860596
187,5374000.0,1.8604798973999999,2.0399999619,170.3225860596
188,5376000.0,1.8422399293200002,2.0399999619,170.3225860596
189,5378000.0,1.8057599908800002,2.0399999619,169.9137878418
190,5380000.0,1.8057599908800002,2.0599999428,169.9137878418
191,5382000.0,1.76928005244,2.0599999428,169.9137878418
192,5384000.0,1.7327999452799998,2.0599999428,169.9137878418
193,5386000.0,1.7327999452799998,2.0599999428,169.9137878418
194,5388000.0,1.6963200068400002,2.0599999428,169.9137878418
195,5390000.0,1.6780800364800001,2.0599999428,169.9137878418
196,5392000.0,1.6598398974000002,2.0599999428,169.9137878418
197,5394000.0,1.62335996124,2.0599999428,169.5032348633
198,5396000.0,1.62335996124,2.0599999428,169.9137878418
199,5398000.0,1.60511999088,2.0799999237,169.5032348633
200,5400000.0,1.5868800228,2.0799999237,170.2807769775
