{
    "1.1.3": {
        "issues_addressed": [
            {
                "issue": "Migrate All pipelines to new poetry CI template",
                "web_link": "https://gitlab.com/romanlabs/ci-templates/package-publish/-/issues/1",
                "description": ""
            }
        ],
        "additional_notes": [
          "Migrated pipeline to new release format"
        ]
    }
  }